ID,NOM,I102,I104,I105,I106,I107_1,I107_2,I107_3,I108,VN,PVO,cluster,strata,WMWT,delivery_lapse,member_id,ANC_visits,ANC_4
1361, , , , , , , , , ,147,1,147,11,23.4999999999999,0, , , 
2905,HASSANE, ,1, , , , , , ,217,2,217,13,31.0074074074074,0, , , 
2905,OUSSEINI, ,1, , , , , , ,217,2,217,13,31.0074074074074,0, , , 
2919,NAZI, , , , , , , , ,218,2,218,11,78.8888888888889,0, , , 
3052,BADARIYA, ,1,5,3,1,1,1,2,222,2,222,12,34.8585858585858,399, ,3,0
3054,HABSATOU, ,1,3,6,1,1,1,2,222,2,222,12,34.8585858585858,186, ,6,1
3625,BADAMASSI, ,1, , , , , , ,241,2,241,22,32.3333333333334,0, , , 
3625,YASSIR, ,1, , , , , , ,241,2,241,22,32.3333333333334,0, , , 
3636,KALIDA, ,1,3,4,2,2,1,1,241,2,241,22,16.1666666666667,0, ,4,1
4225,U, , , , , , , , ,260,2,260,22,32.6599326599327,0, , , 
4225,U, , , , , , , , ,260,2,260,22,32.6599326599327,0, , , 
4226,U, , , , , , , , ,260,2,260,22,32.6599326599327,0, , , 
4226,U, , , , , , , , ,260,2,260,22,32.6599326599327,0, , , 
4246,U, , , , , , , , ,260,2,260,22,32.6599326599327,0, , , 
4246,U, , , , , , , , ,260,2,260,22,32.6599326599327,0, , , 
4246,U, , , , , , , , ,260,2,260,22,32.6599326599327,0, , , 
4302,U, , , , , , , , ,262,2,262,22,21.8923611111112,0, , , 
4302,U, , , , , , , , ,262,2,262,22,21.8923611111112,0, , , 
4359,U, , , , , , , , ,264,2,264,21,67.8189300411523,0, , , 
4359,U, , , , , , , , ,264,2,264,21,67.8189300411523,0, , , 
4360,U, , , , , , , , ,264,2,264,21,67.8189300411523,0, , , 
4360,U, , , , , , , , ,264,2,264,21,67.8189300411523,0, , , 
4400,AWALOU, ,1,5,5,2,2,1,1,265,2,265,23,2.75599128540305,423, ,5,1
4473, , , , , , , , , ,268,2,268,21,45.7777777777778,0, , , 
4473, , , , , , , , , ,268,2,268,21,45.7777777777778,0, , , 
4622,KADIDJA, ,2, , , , , , ,274,2,274,22,16.5143369175628,0, ,0,0
4627,AICHA, ,1,6,3,2,2,2,1,274,2,274,22,16.5143369175628,0, ,3,0
4797,U, , , , , , , , ,279,2,279,23,6.23529411764706,0, , , 
4797,U, , , , , , , , ,279,2,279,23,6.23529411764706,0, , , 
4798,U, , , , , , , , ,279,2,279,23,6.23529411764706,0, , , 
4798,U, , , , , , , , ,279,2,279,23,6.23529411764706,0, , , 
4798,U, , , , , , , , ,279,2,279,23,6.23529411764706,0, , , 
4827,U, , , , , , , , ,301,3,301,1,6.25,0, , , 
4827,U, , , , , , , , ,301,3,301,1,6.25,0, , , 
4830,U, , , , , , , , ,301,3,301,1,6.25,0, , , 
4830,U, , , , , , , , ,301,3,301,1,6.25,0, , , 
4859,U, , , , , , , , ,302,3,302,1,26.6666666666667,0, , , 
4859,U, , , , , , , , ,302,3,302,1,26.6666666666667,0, , , 
4888,U, , , , , , , , ,303,3,303,1,4.33333333333333,0, , , 
4888,U, , , , , , , , ,303,3,303,1,4.33333333333333,0, , , 
5051,ZABEIROU, ,8, , , , , , ,309,3,309,1,16,0, ,0,0
5067,RAHILA, ,8, , , , , , ,309,3,309,1,24,0, ,0,0
5138,U, , , , , , , , ,312,3,312,1,8.24242424242426,0, , , 
5138,U, , , , , , , , ,312,3,312,1,8.24242424242426,0, , , 
5146,U, , , , , , , , ,312,3,312,1,8.24242424242426,0, , , 
5146,U, , , , , , , , ,312,3,312,1,8.24242424242426,0, , , 
5146,U, , , , , , , , ,312,3,312,1,8.24242424242426,0, , , 
5185,U, , , , , , , , ,313,3,313,1,6.11764705882355,0, , , 
5185,U, , , , , , , , ,313,3,313,1,6.11764705882355,0, , , 
5362,U, , , , , , , , ,319,3,319,1,6.06060606060606,0, , , 
5362,U, , , , , , , , ,319,3,319,1,6.06060606060606,0, , , 
5362,U, , , , , , , , ,319,3,319,1,6.06060606060606,0, , , 
5367,U, , , , , , , , ,319,3,319,1,6.06060606060606,0, , , 
5367,U, , , , , , , , ,319,3,319,1,6.06060606060606,0, , , 
5368,U, , , , , , , , ,319,3,319,1,6.06060606060606,0, , , 
5368,U, , , , , , , , ,319,3,319,1,6.06060606060606,0, , , 
5385,U, , , , , , , , ,319,3,319,1,6.06060606060606,0, , , 
5385,U, , , , , , , , ,319,3,319,1,6.06060606060606,0, , , 
5386,U, , , , , , , , ,319,3,319,1,30.3030303030303,0, , , 
5386,U, , , , , , , , ,319,3,319,1,30.3030303030303,0, , , 
5386,U, , , , , , , , ,319,3,319,1,30.3030303030303,0, , , 
5387,U, , , , , , , , ,319,3,319,1,18.1818181818182,0, , , 
5387,U, , , , , , , , ,319,3,319,1,18.1818181818182,0, , , 
5393,U, , , , , , , , ,319,3,319,1,6.06060606060606,0, , , 
5393,U, , , , , , , , ,319,3,319,1,6.06060606060606,0, , , 
5393,U, , , , , , , , ,319,3,319,1,6.06060606060606,0, , , 
5529,U, , , , , , , , ,324,3,324,1,33.3333333333333,0, , , 
5529,U, , , , , , , , ,324,3,324,1,33.3333333333333,0, , , 
5529,U, , , , , , , , ,324,3,324,1,33.3333333333333,0, , , 
5531,U, , , , , , , , ,324,3,324,1,33.3333333333333,0, , , 
5531,U, , , , , , , , ,324,3,324,1,33.3333333333333,0, , , 
5590,U, , , , , , , , ,326,3,326,1,11.7647058823529,0, , , 
5590,U, , , , , , , , ,326,3,326,1,11.7647058823529,0, , , 
5600,U, , , , , , , , ,326,3,326,1,5.88235294117647,0, , , 
5600,U, , , , , , , , ,326,3,326,1,5.88235294117647,0, , , 
5933,U, , , , , , , , ,337,3,337,1,4.08333333333333,0, , , 
5933,U, , , , , , , , ,337,3,337,1,4.08333333333333,0, , , 
6050,U, , , , , , , , ,341,3,341,1,23.4375,0, , , 
6050,U, , , , , , , , ,341,3,341,1,23.4375,0, , , 
6061,U, , , , , , , , ,341,3,341,1,7.8125,0, , , 
6061,U, , , , , , , , ,341,3,341,1,7.8125,0, , , 
6067,U, , , , , , , , ,342,3,342,1,20,0, , , 
6067,U, , , , , , , , ,342,3,342,1,20,0, , , 
6078,U, , , , , , , , ,342,3,342,1,20,0, , , 
6078,U, , , , , , , , ,342,3,342,1,20,0, , , 
6078,U, , , , , , , , ,342,3,342,1,20,0, , , 
6186,U, , , , , , , , ,346,3,346,1,23.2258064516129,0, , , 
6186,U, , , , , , , , ,346,3,346,1,23.2258064516129,0, , , 
6186,U, , , , , , , , ,346,3,346,1,23.2258064516129,0, , , 
6190,U, , , , , , , , ,346,3,346,1,5.80645161290323,0, , , 
6190,U, , , , , , , , ,346,3,346,1,5.80645161290323,0, , , 
6191,U, , , , , , , , ,346,3,346,1,11.6129032258065,0, , , 
6191,U, , , , , , , , ,346,3,346,1,11.6129032258065,0, , , 
6191,U, , , , , , , , ,346,3,346,1,11.6129032258065,0, , , 
6193,U, , , , , , , , ,346,3,346,1,5.80645161290323,0, , , 
6193,U, , , , , , , , ,346,3,346,1,5.80645161290323,0, , , 
6211,U, , , , , , , , ,347,3,347,1,5.99999999999999,0, , , 
6211,U, , , , , , , , ,347,3,347,1,5.99999999999999,0, , , 
6426, , , , , , , , , ,354,3,354,1,20.6896551724138,0, , , 
6473,U, , , , , , , , ,355,3,355,1,13.7931034482759,0, , , 
6473,U, , , , , , , , ,355,3,355,1,13.7931034482759,0, , , 
6473,U, , , , , , , , ,355,3,355,1,13.7931034482759,0, , , 
6484,U, , , , , , , , ,356,3,356,1,6.25,0, , , 
6484,U, , , , , , , , ,356,3,356,1,6.25,0, , , 
6489,U, , , , , , , , ,356,3,356,1,6.25,0, , , 
6489,U, , , , , , , , ,356,3,356,1,6.25,0, , , 
6490,U, , , , , , , , ,356,3,356,1,12.5,0, , , 
6490,U, , , , , , , , ,356,3,356,1,12.5,0, , , 
6491,U, , , , , , , , ,356,3,356,1,6.25,0, , , 
6491,U, , , , , , , , ,356,3,356,1,6.25,0, , , 
6492,U, , , , , , , , ,356,3,356,1,6.25,0, , , 
6492,U, , , , , , , , ,356,3,356,1,6.25,0, , , 
6500,U, , , , , , , , ,356,3,356,1,6.25,0, , , 
6500,U, , , , , , , , ,356,3,356,1,6.25,0, , , 
6504,U, , , , , , , , ,356,3,356,1,6.25,0, , , 
6504,U, , , , , , , , ,356,3,356,1,6.25,0, , , 
6519,U, , , , , , , , ,357,3,357,1,13.3333333333333,0, , , 
6519,U, , , , , , , , ,357,3,357,1,13.3333333333333,0, , , 
6522,U, , , , , , , , ,357,3,357,1,13.3333333333333,0, , , 
6522,U, , , , , , , , ,357,3,357,1,13.3333333333333,0, , , 
6527,U, , , , , , , , ,357,3,357,1,26.6666666666667,0, , , 
6527,U, , , , , , , , ,357,3,357,1,26.6666666666667,0, , , 
6527,U, , , , , , , , ,357,3,357,1,26.6666666666667,0, , , 
6530,U, , , , , , , , ,357,3,357,1,26.6666666666667,0, , , 
6530,U, , , , , , , , ,357,3,357,1,26.6666666666667,0, , , 
6534,U, , , , , , , , ,357,3,357,1,13.3333333333333,0, , , 
6534,U, , , , , , , , ,357,3,357,1,13.3333333333333,0, , , 
6538,U, , , , , , , , ,357,3,357,1,13.3333333333333,0, , , 
6538,U, , , , , , , , ,357,3,357,1,13.3333333333333,0, , , 
6539,U, , , , , , , , ,357,3,357,1,26.6666666666667,0, , , 
6539,U, , , , , , , , ,357,3,357,1,26.6666666666667,0, , , 
6539,U, , , , , , , , ,357,3,357,1,26.6666666666667,0, , , 
6540,U, , , , , , , , ,357,3,357,1,13.3333333333333,0, , , 
6540,U, , , , , , , , ,357,3,357,1,13.3333333333333,0, , , 
6543,U, , , , , , , , ,358,3,358,1,10,0, , , 
6543,U, , , , , , , , ,358,3,358,1,10,0, , , 
6543,U, , , , , , , , ,358,3,358,1,10,0, , , 
6544,U, , , , , , , , ,358,3,358,1,10,0, , , 
6544,U, , , , , , , , ,358,3,358,1,10,0, , , 
6548,U, , , , , , , , ,358,3,358,1,10,0, , , 
6548,U, , , , , , , , ,358,3,358,1,10,0, , , 
6558,U, , , , , , , , ,358,3,358,1,10,0, , , 
6558,U, , , , , , , , ,358,3,358,1,10,0, , , 
6560,U, , , , , , , , ,358,3,358,1,10,0, , , 
6560,U, , , , , , , , ,358,3,358,1,10,0, , , 
6637,U, , , , , , , , ,361,3,361,1,20,0, , , 
6677,U, , , , , , , , ,362,3,362,1,9.14285714285714,0, , , 
6677,U, , , , , , , , ,362,3,362,1,9.14285714285714,0, , , 
6677,U, , , , , , , , ,362,3,362,1,9.14285714285714,0, , , 
6689,U, , , , , , , , ,362,3,362,1,27.4285714285714,0, , , 
6689,U, , , , , , , , ,362,3,362,1,27.4285714285714,0, , , 
6691,U, , , , , , , , ,362,3,362,1,9.14285714285714,0, , , 
6691,U, , , , , , , , ,362,3,362,1,9.14285714285714,0, , , 
6816,U, , , , , , , , ,333,3,333,1,24.2424242424242,0, , , 
6816,U, , , , , , , , ,333,3,333,1,24.2424242424242,0, , , 
6816,U, , , , , , , , ,333,3,333,1,24.2424242424242,0, , , 
6982,U, , , , , , , , ,372,3,372,1,26.6666666666667,0, , , 
6982,U, , , , , , , , ,372,3,372,1,26.6666666666667,0, , , 
6982,U, , , , , , , , ,372,3,372,1,26.6666666666667,0, , , 
7024,MOUBARAK, ,8, , , , , , ,373,3,373,1,6.13333333333334,0, ,0,0
7044,SAWIYA, ,8, , , , , , ,374,3,374,1,16.1290322580645,0, ,0,0
7094,SOULEY, , , , , , , , ,375,3,375,1,4.24137931034483,456, , , 
7111,MQMQN, ,1,7,2,2,1,1,1,376,3,376,1,6.85714285714287,0, ,2,0
7211,U, , , , , , , , ,379,3,379,1,6.06060606060606,0, , , 
7211,U, , , , , , , , ,379,3,379,1,6.06060606060606,0, , , 
7211,U, , , , , , , , ,379,3,379,1,6.06060606060606,0, , , 
7246,U, , , , , , , , ,380,3,380,1,46.6666666666666,0, , , 
7246,U, , , , , , , , ,380,3,380,1,46.6666666666666,0, , , 
7247,U, , , , , , , , ,380,3,380,1,93.3333333333332,0, , , 
7247,U, , , , , , , , ,380,3,380,1,93.3333333333332,0, , , 
7248,U, , , , , , , , ,380,3,380,1,46.6666666666666,0, , , 
7248,U, , , , , , , , ,380,3,380,1,46.6666666666666,0, , , 
7249,U, , , , , , , , ,380,3,380,1,46.6666666666666,0, , , 
7249,U, , , , , , , , ,380,3,380,1,46.6666666666666,0, , , 
7253,U, , , , , , , , ,380,3,380,1,46.6666666666666,0, , , 
7253,U, , , , , , , , ,380,3,380,1,46.6666666666666,0, , , 
7256,U, , , , , , , , ,380,3,380,1,46.6666666666666,0, , , 
7256,U, , , , , , , , ,380,3,380,1,46.6666666666666,0, , , 
7315,U, , , , , , , , ,223,2,223,13,34.2939068100357,0, , , 
7315,U, , , , , , , , ,223,2,223,13,34.2939068100357,0, , , 
7362,U, , , , , , , , ,169,1,169,11,28.1999999999999,0, , , 
7362,U, , , , , , , , ,169,1,169,11,28.1999999999999,0, , , 
7362,U, , , , , , , , ,169,1,169,11,28.1999999999999,0, , , 
7367,U, , , , , , , , ,138,1,138,12,11.2,0, , , 
7367,U, , , , , , , , ,138,1,138,12,11.2,0, , , 
7375,U, , , , , , , , ,138,1,138,12,22.4,0, , , 
7375,U, , , , , , , , ,138,1,138,12,22.4,0, , , 
7375,U, , , , , , , , ,138,1,138,12,22.4,0, , , 
7378,U, , , , , , , , ,138,1,138,12,11.2,0, , , 
7378,U, , , , , , , , ,138,1,138,12,11.2,0, , , 
7425,U, , , , , , , , ,180,1,180,14,3.23529411764706,0, , , 
7425,U, , , , , , , , ,180,1,180,14,3.23529411764706,0, , , 
7619,U, , , , , , , , ,228,2,228,21,83.2323232323233,0, , , 
7619,U, , , , , , , , ,228,2,228,21,83.2323232323233,0, , , 
7624,U, , , , , , , , ,228,2,228,21,83.2323232323233,0, , , 
7624,U, , , , , , , , ,228,2,228,21,83.2323232323233,0, , , 
7632,U, , , , , , , , ,228,2,228,21,249.69696969697,0, , , 
7632,U, , , , , , , , ,228,2,228,21,249.69696969697,0, , , 
7632,U, , , , , , , , ,228,2,228,21,249.69696969697,0, , , 
8004,U, , , , , , , , ,372,3,372,1,40,0, , , 
8004,U, , , , , , , , ,372,3,372,1,40,0, , , 
78,CHAFA,2,1,3,4,2,1,1,1,103,1,103,11,33.0879999999999,0,780002,4,1
78,CHAMSIA,2,1,4,4,2,1,1,2,103,1,103,11,33.0879999999999,0,780002,4,1
396,RAOUF,3,1,3,5,1,1,2,1,114,1,114,14,31.6,316,3960003,5,1
396,NAZIROU,3,1,5,4,2,1,1,2,114,1,114,14,31.6,316,3960003,4,1
405,RACHIDOU,10,1,7,3,2,2,1,1,114,1,114,14,39.5,386,4050010,3,0
405,AICHA,10,1,6,3,1,1,2,2,114,1,114,14,39.5,386,4050010,3,0
405,FOURERA,10,1,5,4,1,1,1,1,114,1,114,14,39.5,386,4050010,4,1
408,IBRAHIM,3,1,4,7,2,1,1,1,114,1,114,14,31.6,0,4080003,7,1
408,NANA RAFIA,3,1,3,6,2,1,1,1,114,1,114,14,31.6,0,4080003,6,1
422,SADI,3,1,4,4,2,2,2,2,114,1,114,14,15.8,195,4220003,4,1
422,HALIMA,3,1,4,3,2,2,2,2,114,1,114,14,15.8,195,4220003,3,0
438,FAIZA,2,1,4,5,1,1,1,1,115,1,115,14,25.6666666666667,636,4380002,5,1
438,FARIDA,2,1,4,4,1,1,1,1,115,1,115,14,25.6666666666667,636,4380002,4,1
443,MARHIYA,3,1,4,5,1,2,1,1,115,1,115,14,25.6666666666667,79,4430003,5,1
443,SAMIRA,3,1,5,4,1,2,2,1,115,1,115,14,25.6666666666667,79,4430003,4,1
464,NAHIOU,3,1,5,4,2,1,2,2,116,1,116,12,33.6,169,4640003,4,1
464,SOUFIYA,3,1,3,3,1,1,1,1,116,1,116,12,33.6,169,4640003,3,0
470,LANTANA,2,1,4,2,1,1,2,2,116,1,116,12,22.4,352,4700002,2,0
470,ZEITOUNA,2,1,5,4,1,2,1,1,116,1,116,12,22.4,352,4700002,4,1
501,MOUSTAPHA,12,1,6,2,2,2,2,1,117,1,117,14,35.4838709677419,0,5010012,2,0
501,SOUEBA,12,1,5,3,2,2,2,1,117,1,117,14,35.4838709677419,0,5010012,3,0
501,AMINOU,12,1, ,1,2,2,2,2,117,1,117,14,35.4838709677419,0,5010012,1,0
547,HAMBALI,7,1,3,6,2,2,2,1,118,1,118,14,38.878125,0,5470007,6,1
547,KADIDJA,7,1,4,6,2,1,1,1,118,1,118,14,38.878125,0,5470007,6,1
584,MARIAMA,9,1,6,3,2,1,1,1,121,1,121,14,32.3714285714287,434,5840009,3,0
584,SOULEYMANE,9,1,5,4,1,2,1,1,121,1,121,14,32.3714285714287,434,5840009,4,1
615,SEIFOULAYE,6,1,3,4,2,2,2,1,122,1,122,12,33.9612903225806,412,6150006,4,1
615,NAZIFI,6,1,5,4,2,1,1,1,122,1,122,12,33.9612903225806,412,6150006,4,1
625,SOUWAIBA,2,1,6,3,1,2,2,1,122,1,122,12,16.9806451612903,250,6250002,3,0
625,MABAROUKA,2,1,5,4,2,1,1,1,122,1,122,12,16.9806451612903,250,6250002,4,1
631,KAMILOU,8,1,6,3,1,1,2,2,122,1,122,12,50.9419354838709,99,6310008,3,0
631,MOUSTAPHA,8,1,5,4,1,2,1,1,122,1,122,12,50.9419354838709,99,6310008,4,1
635,JAMILA,10,1,5,4,2,2,1,1,122,1,122,12,33.9612903225806,391,6350010,4,1
635,NANA AMIRA,10,1,5,4,1,1,2,1,122,1,122,12,33.9612903225806,391,6350010,4,1
638,NASSIROU,3,1,5,4,2,2,1,1,122,1,122,12,33.9612903225806,411,6380003,4,1
638,AICHA,3,1,4,4,1,1,1,1,122,1,122,12,33.9612903225806,411,6380003,4,1
640,RACHIDA,2,1,5,4,1,1,2,1,122,1,122,12,33.9612903225806,0,6400002,4,1
640,ABDOUL RACHID,2,1,4,4,1,1,1,1,122,1,122,12,33.9612903225806,0,6400002,4,1
642,JAMILOU,4,1,5,4,1,1,2,1,123,1,123,13,168.33870967742,0,6420004,4,1
642,MOURTALA,4,1,4,4,2,1,1,2,123,1,123,13,168.33870967742,0,6420004,4,1
653,MAIMOUNA,2,1,2,4,2,2,2,1,123,1,123,13,48.0967741935484,442,6530002,4,1
653,SAHIYA,2,1,5,4,2,1,1,1,123,1,123,13,48.0967741935484,442,6530002,4,1
658,OUSSOUNA,2,1,3,7,1,1,1,1,123,1,123,13,96.1935483870968,569,6580002,7,1
658,OUSSOUMANE,2,1,4,5,1,1,1,1,123,1,123,13,96.1935483870968,569,6580002,5,1
659,AICHA,2,1,3,7,1,1,1,1,123,1,123,13,96.1935483870968,504,6590002,7,1
659,SOULEYMANE,2,1,5,3,1,1,1,1,123,1,123,13,96.1935483870968,504,6590002,3,0
659,ISSOUBO,2,1,4,8,1,1,1,1,123,1,123,13,96.1935483870968,504,6590002,8,1
670,NANA RIZEINA,3,1,6,3,1,1,1,1,123,1,123,13,48.0967741935484,716,6700003,3,0
670,LARWANA,3,1,4,4,1,1,2,1,123,1,123,13,48.0967741935484,716,6700003,4,1
678,ABDOUL MAJID,5,1,6,1,2,1,2,2,124,1,124,13,18.1481481481481,438,6780005,1,0
678,BADIOU,5,1,7,2,2,2,2,2,124,1,124,13,18.1481481481481,438,6780005,2,0
699,ANAFI,8,1,6,4,1,1,2,1,124,1,124,13,18.1481481481481,219,6990008,4,1
699,FAHAD,8,1,4,4,1,1,2,1,124,1,124,13,18.1481481481481,219,6990008,4,1
710,SAMAILA,2,1,4,4,2,1,2,2,125,1,125,13,25.59375,0,7100002,4,1
710,MARIAMA,2,1,5,4,1,1,1,1,125,1,125,13,25.59375,0,7100002,4,1
727,LAMI,10,1,3,3,2,2,1,1,125,1,125,13,25.59375,324,7270010,3,0
727,ABDOUL RAZAK,10,1,4,4,2,1,1,1,125,1,125,13,25.59375,324,7270010,4,1
728,SAMAILA,2,1,6,3,2,2,1,1,125,1,125,13,25.59375,469,7280002,3,0
728,NAFISSA,2,1,5,4,2,2,1,1,125,1,125,13,25.59375,469,7280002,4,1
747,FIRDASSOU,2,1,4,3,1,1,1,1,126,1,126,14,24.0625,0,7470002,3,0
747,ZINA,2,1,5,4,1,1,1,2,126,1,126,14,24.0625,0,7470002,4,1
782,LAMINOU,2,1,3,7,2,1,1,1,127,1,127,13,10.6060606060606,0,7820002,7,1
782,CHAMSOU,2,1,3,8,2,1,1,1,127,1,127,13,10.6060606060606,0,7820002,8,1
785,AMIRA,2,1,3,7,2,1,1,1,127,1,127,13,21.2121212121212,0,7850002,7,1
785,ZEIYA,2,1,5,4,1,1,2,1,127,1,127,13,21.2121212121212,0,7850002,4,1
807,SANOUSSI,2,1,4,4,2,2,1,1,128,1,128,14,21.2903225806452,440,8070002,4,1
807,BASSIRA,2,1,6,2,2,2,1,2,128,1,128,14,21.2903225806452,440,8070002,2,0
828,SAHIBA,9,1,4,4,2,1,1,1,129,1,129,14,15.2533333333334,439,8280009,4,1
828,FAIZA,9,1,5,4,2,1,1,1,129,1,129,14,15.2533333333334,439,8280009,4,1
830,AICHA,7,1,4,5,2,1,1,1,129,1,129,14,15.2533333333334,214,8300007,5,1
830,ROUFAI,7,1,3,6,2,1,1,1,129,1,129,14,15.2533333333334,214,8300007,6,1
830,ZOUERA,7,1,5,4,1,1,1,1,129,1,129,14,15.2533333333334,214,8300007,4,1
852,SAFARAOU,2,1,4,4,2,1,1,1,129,1,129,14,15.2533333333334,0,8520002,4,1
852,NADIA,2,1,5,3,2,2,1,1,129,1,129,14,15.2533333333334,0,8520002,3,0
858,SALAHA,2,1,5,4,1,1,1,1,130,1,130,11,112.8,195,8580002,4,1
858,LAHIYA,2,1,3,2,1,1,1,1,130,1,130,11,112.8,195,8580002,2,0
881,RAHAMA,3,1,7,4,2,1,1,1,130,1,130,11,169.2,257,8810003,4,1
881,SAMINOU,3,1,4,4,2,1,1,1,130,1,130,11,169.2,257,8810003,4,1
901,ZAHARA,5,1,4,4,2,1,1,2,131,1,131,11,100.064516129032,223,9010005,4,1
901,HADJARA,5,1,4,1,2,2,2,2,131,1,131,11,100.064516129032,223,9010005,1,0
1082,HASSAN,2,1,4,5,2,1,2,1,137,1,137,11,60.0387096774191,420,10820002,5,1
1082,OUSSEINI,2,1,4,5,2,1,2,1,137,1,137,11,60.0387096774191,420,10820002,5,1
1185,SAMINOU,2,1,6,2,1,1,1,1,140,1,140,11,37.5999999999999,666,11850002,2,0
1185,KAMALADINE,2,1,4,4,1,1,1,1,140,1,140,11,37.5999999999999,666,11850002,4,1
1196,3,3,1,5,3,2,2,2,1,142,1,142,14,24.86,121,11960003,3,0
1196,ABOUBACAR,3,1,4,4,1,1,1,1,142,1,142,14,24.86,121,11960003,4,1
1279,RAKILOU,2,1,3,4,2,1,2,2,143,1,143,12,45.1612903225807,395,12790002,4,1
1279,AL ANAS,2,1,3,3,2,1,2,2,143,1,143,12,45.1612903225807,395,12790002,3,0
1280,CHAPIOU,2,8, , , , , , ,144,1,144,11,42.7272727272726,461,12800002,0,0
1280,RABIOU,2,1,3,4,1,2,2,1,144,1,144,11,42.7272727272726,461,12800002,4,1
1459,GAMBO,2,1,3,3,1,2,2,1,149,1,149,12,20.0827586206897,242,14590002,3,0
1459,2,2,1,3,3,1,2,2,1,149,1,149,12,20.0827586206897,242,14590002,3,0
1719,LOUKMANE,2,1,4,4,2,1,1,2,158,1,158,13,27.2575757575759,0,17190002,4,1
1719,CHAMSIA,2,1,3,5,2,1,1,2,158,1,158,13,27.2575757575759,0,17190002,5,1
1796,OUMEWA,2,1,7,2,1,1,2,2,160,1,160,12,17.1733333333333,402,17960002,2,0
1796,15,2,1,4,15,1,2,1,1,160,1,160,12,17.1733333333333,402,17960002,15,1
1813,MOUSTAPHA,6,1,5,4,1,1,2,1,161,1,161,12,41.1250000000001,426,18130006,4,1
1813,SOUFIANOU,6,1,6,4,1,1,2,2,161,1,161,12,41.1250000000001,426,18130006,4,1
1861,KAMALANDINI,2,1,5,4,2,2,2,1,163,1,163,13,10.5,272,18610002,4,1
1861,SAIFOULAHI,2,1,6,2,2,2,2,2,163,1,163,13,10.5,272,18610002,2,0
1888,RACHIDA,9,1,3,4,2,2,1,1,163,1,163,13,21,222,18880009,4,1
1888,NANA HOUWAILA,9,1,4,5,2,2,1,2,163,1,163,13,21,222,18880009,5,1
1896,CHAPIOU,2,1,7,2,2,1,1,2,164,1,164,12,14.7225806451613,190,18960002,2,0
1896,SADIKOU,2,1,4,3,1,1,1,1,164,1,164,12,14.7225806451613,190,18960002,3,0
1899,ABDOUL KARIM,2,1,4,4,1,1,1,2,164,1,164,12,14.7225806451613,0,18990002,4,1
1899,ABDOUL AZIZ,2,1,3,4,1,2,1,1,164,1,164,12,14.7225806451613,0,18990002,4,1
1906,AICHA,2,1,5,4,2,2,1,2,164,1,164,12,29.4451612903225,0,19060002,4,1
1906,HABIBOU,2,1,4,4,2,2,1,2,164,1,164,12,29.4451612903225,0,19060002,4,1
1915,FATCHIMA,8,1,6,3,1,1,1,1,164,1,164,12,29.4451612903225,0,19150008,3,0
1915,ZEINAB,8,1,4,4,2,1,1,1,164,1,164,12,29.4451612903225,0,19150008,4,1
1925,ALIOU,8,1,6,3,1,1,1,1,165,1,165,11,54.741176470588,743,19250008,3,0
1925,MABAROUKA,8,1,5,4,2,1,1,1,165,1,165,11,54.741176470588,743,19250008,4,1
1932,MOCTAR,2,1,5,4,2,1,1,1,165,1,165,11,109.482352941176,360,19320002,4,1
1932,NASSEYFA,2,1,6,3,1,1,1,1,165,1,165,11,109.482352941176,360,19320002,3,0
1935,ZARAOU,3,1,4,5,2,2,2,2,165,1,165,11,54.741176470588,159,19350003,5,1
1935,AMIROU,3,1,5,4,2,2,2,2,165,1,165,11,54.741176470588,159,19350003,4,1
1950,SAGUIR,2,1,5,4,1,1,1,1,165,1,165,11,27.370588235294,158,19500002,4,1
1950,SABIOU,2,1,6,3,1,1,1,1,165,1,165,11,27.370588235294,158,19500002,3,0
1990,AICHATOU,7,1,3,6,1,1,2,1,167,1,167,11,28.4764705882352,593,19900007,6,1
1990,HANATOU,7,1,5,4,2,1,1,2,167,1,167,11,28.4764705882352,593,19900007,4,1
1992,ABDOUL RACHID,6,1,4,5,2,1,1,2,167,1,167,11,28.4764705882352,0,19920006,5,1
1992,ABDOUL KADER,6,1,4,4,2,1,1,1,167,1,167,11,28.4764705882352,0,19920006,4,1
2007,HASSAN,8,1,4,4,2,1,1,1,167,1,167,11,56.9529411764704,0,20070008,4,1
2007,OUSSEINI,8,1,4,4,2,1,1,1,167,1,167,11,56.9529411764704,0,20070008,4,1
2067,NAZIFI,2,1,6,4,2,1,2,1,169,1,169,11,28.1999999999999,189,20670002,4,1
2067,13,2,1,3,2,2,2,2,2,169,1,169,11,28.1999999999999,189,20670002,2,0
2168,2,2,2, , , , , , ,172,1,172,11,18.8,386,21680002,0,0
2168,MANSOURA,2,1,5,2,2,2,2,2,172,1,172,11,18.8,386,21680002,2,0
2177,SEFOULAYE,2,1,4,4,1,1,2,2,173,1,173,12,16.8,497,21770002,4,1
2177,ZALIKA,2,1,4,4,1,1,2,2,173,1,173,12,16.8,497,21770002,4,1
2324,HABIBOU,10,1,3,4,1,1,1,1,178,1,178,11,56.3999999999999,0,23240010,4,1
2324,HAMA,10,1,4,5,1,1,1,1,178,1,178,11,56.3999999999999,0,23240010,5,1
2327,ABDOU,2,1,3,3,1,1,1,1,178,1,178,11,37.5999999999999,0,23270002,3,0
2327,HAMISSOU,2,1,4,5,1,1,1,2,178,1,178,11,37.5999999999999,0,23270002,5,1
2331,LAOURE,2,1,3,6,1,1,1,1,178,1,178,11,18.8,0,23310002,6,1
2331,SIRADJI,2,1,3,6,1,1,1,1,178,1,178,11,18.8,0,23310002,6,1
2331,HABOU,2,1,3,6,1,1,1,1,178,1,178,11,18.8,0,23310002,6,1
2332,HADIZA,2,1,3,6,1,1,1,1,178,1,178,11,37.5999999999999,0,23320002,6,1
2332,ADAMOU,2,1,5,4,1,1,1,1,178,1,178,11,37.5999999999999,0,23320002,4,1
2332,ABDOURAMANE,2,1,6,3,1,1,1,1,178,1,178,11,37.5999999999999,0,23320002,3,0
2350,MARIAMA,2,1,5,3,2,2,1,1,179,1,179,13,14.21875,116,23500002,3,0
2350, ,2, , , , , , , ,179,1,179,13,14.21875,116,23500002, , 
2683,NAZIROU,4,1,4,3,1,1,1,1,210,2,210,13,26.0202020202021,507,26830004,3,0
2683,SAGUIROU,4, , , , , , , ,210,2,210,13,26.0202020202021,507,26830004, , 
2714,SAMOUSSI,8,1,4,2,2,2,1,1,211,2,211,12,34,0,27140008,2,0
2714,SAIYA,8,1,3,9,1,1,1,1,211,2,211,12,34,0,27140008,9,1
2719,JAMILA,2, , , , , , , ,211,2,211,12,136,0,27190002, , 
2719,OUMAROU,2, , , , , , , ,211,2,211,12,136,0,27190002, , 
2728,OUZEIROU,2,1,4,3,2,2,2,1,211,2,211,12,67.9999999999999,415,27280002,3,0
2728,13,2,1,4,3,2,2,2,1,211,2,211,12,67.9999999999999,415,27280002,3,0
2728,13,2,1,4,3,2,2,2,1,211,2,211,12,67.9999999999999,415,27280002,3,0
2732,BEBE,6,1,3,4,2,2,1,1,211,2,211,12,102,370,27320006,4,1
2732,ROUKAYA,6, , , , , , , ,211,2,211,12,102,370,27320006, , 
2735,BADARIA,4,1,3,5,1,1,2,1,211,2,211,12,102,0,27350004,5,1
2735,BACHARA,4, , , , , , , ,211,2,211,12,102,0,27350004, , 
2742,ABDOUL SAMADE,9,1,5,4,2,2,2,1,212,2,212,12,39.4838709677418,0,27420009,4,1
2742,MARRAWIYA,9, , , , , , , ,212,2,212,12,39.4838709677418,0,27420009, , 
2794,ALISA,3,1,3,7,2,1,1,1,213,2,213,12,69.9540229885056,583,27940003,7,1
2794,KAMOUSOU,3, , , , , , , ,213,2,213,12,69.9540229885056,583,27940003, , 
2848,ABKARA,4,1,4,6,1,1,1,1,215,2,215,11,98.7383512544805,103,28480004,6,1
2848,NOURA,4,1, , , , , , ,215,2,215,11,98.7383512544805,103,28480004, , 
3043,ROUWEIDA,2,1,5,3,2,2,1,1,222,2,222,12,69.7171717171717,530,30430002,3,0
3043,MOUSTAPHA,2, , , , , , , ,222,2,222,12,69.7171717171717,530,30430002, , 
3046,ADAM,2,1,5,4,2,1,1,1,222,2,222,12,69.7171717171717,489,30460002,4,1
3046,ADAMA,2,1,5,4,2,1,1,1,222,2,222,12,69.7171717171717,489,30460002,4,1
3078,BEBE,4,1,4,3,2,2,1,1,224,2,224,12,67.6565656565657,0,30780004,3,0
3078,CHAHAWA,4, , , , , , , ,224,2,224,12,67.6565656565657,0,30780004, , 
3080,HASSAN,10,1,4,4,2,1,1,1,224,2,224,12,67.6565656565657,0,30800010,4,1