PAIS,IDNUM,ESTRATOPRI,UPM,NICDEPT,NICMUNICIPIO,NICBARRIO,SEGMENTO,SEC,CLUSTER,UR,TAMANO,NICIDIOMA,DIA,MES,Q1,A4,DEM13A,DEM13B,DEM13C,DEM13D,A1,A2,A3,A4I,SOCT1,SOCT2,IDIO1,IDIO2,CP2,CP4A,CP4,PROT1,PROT2,CP5,CP5A,CP5B,CP5C,CP5D,CP6,CP7,CP8,CP9,CP10,CP13,LS3,IT1,L1,NP1,NP1B,NP2,SGL1,SGL2,LGL2,LGL3,MUNI5,MUNI6,MUNI8,MUNI9,MUNI10,MUNI11,MUNI15,JC1,JC4,JC10,JC12,JC13,JC15,JC16,POP1,POP2,POP3,POP4,POP5,VIC1,VIC2,AOJ8,AOJ11,AOJ11A,AOJ12,AOJ17,B1,B2,B3,B4,B6,B10A,B11,B12,B13,B14,B15,B18,B20,B21,B31,B32,B43,B16,B17,B19,B37,B47,N1,N3,N9,N10,N11,N12,M1,ING4,PN2,DEM23,PN4,PN5,E5,E8,E11,E15,E14,E2,E3,E16,NICE17,D32,D33,D34,D36,D37,D1,D2,D3,D4,D5,DEM2,AUT1,PP1,PP2,DC1,DC10,DC13,EXC2,EXC6,EXC11,NICEXC12,EXC13,EXC14,EXC15,EXC16,EXC17,EXC18,EXC19,EXC7,GI1,GI2,GI3,GI4,GI5,VB1,VB2,NICVB3,VB4,VB8,VB6,NICVB7,VB10,NICVB11,POL1,NICPOL3,NICPOL4,POL2,NICPOL5,AA1,AA2,AA3,AA4,DIS2,DIS3,DIS4,DIS5,ED,Q2,Q3,Q10,Q10A,Q10B,Q10C,Q14,Q10D,Q11,Q12,NICETID,NICETIDA,NICLENG1,NICLENG1A,NICLENG4,R1,R3,R4,R4A,R5,R6,R7,R8,R12,R14,R15,OCUP1,OCUP4,OCUP1A,OCUP1B1,OCUP1C,DESOC2,MIG1,MIG2,MIG3,TI,edad
5,1,501,1,1,1,1,102,1,1,1,3,1,14,6,1,3,3,27,0,27,1,1,3,3,4,2,3,2,2,2,2,3,,2,,,,,1,4,2,2,4,1,3,4,4,2,3,,3,3,2,2,0,1,0,,,4,2,2,2,2,1,2,2,2,2,2,2,1,2,2,,1,2,1,1,3,2,1,1,2,3,4,2,5,1,1,1,5,7,1,1,2,4,1,2,1,2,2,1,7,2,3,2,1,3,2,3,2,3,3,10,9,9,1,1,1,1,1,1,9,2,1,1,1,6,5,4,2,1,2,1,3,2,1,1,1,0,0,,0,,,1,0,1,0,0,2,1,8,8,1,8,1,2,,6,,2,,1,2,3,1,3,4,2,2,2,3,4,2,2,2,2,11,18,1,4,3,4,3,2,3,1,0,1,1,1,7,1,1,0,1,1,0,0,0,0,1,0,0,12,,,,,,3,1,,35,1
5,2,501,1,1,1,1,102,1,1,1,3,1,14,6,1,22,3,4,7,4,3,3,4,4,5,3,4,3,2,2,2,3,,1,1,1,1,2,3,2,1,3,4,4,1,1,6,2,3,2,,2,4,2,1,3,1,2,1,,1,,2,2,2,,,,1,2,2,2,2,2,,2,4,1,1,1,3,2,4,5,6,3,2,6,6,2,6,7,7,5,7,7,7,6,5,5,4,7,1,3,2,1,2,1,4,5,7,6,4,4,5,4,5,1,1,1,3,4,2,4,5,5,4,3,3,2,1,1,1,1,2,4,2,1,1,1,0,0,1,0,,,1,,0,1,0,1,8,8,8,2,8,1,1,1,,3,1,1,1,1,4,1,3,5,1,1,1,7,3,1,1,1,1,0,67,1,1,,,3,2,4,2,8,3,1,1,1,1,1,0,0,1,0,0,0,0,1,0,0,5,1,4,1,2,,1,1,,39,6
5,3,501,1,1,1,1,102,1,1,1,3,1,14,6,1,1,3,0,0,,4,1,3,4,5,2,2,2,1,1,2,3,,2,,,,,1,3,4,4,4,4,1,1,5,2,3,2,4,5,2,2,0,1,1,4,1,3,1,2,2,2,2,2,2,2,2,2,2,2,2,1,7,1,4,1,3,4,4,7,7,3,7,4,2,6,4,5,5,7,4,2,2,6,7,5,6,5,6,3,1,2,2,4,2,1,4,1,1,1,1,3,9,8,10,1,1,2,10,9,8,1,3,5,9,10,2,9,10,9,2,2,2,2,2,1,2,2,0,0,,0,,0,,,0,0,0,1,1,2,2,1,1,1,1,1,,3,1,1,1,1,4,1,3,2,1,3,2,1,1,2,2,2,2,11,34,1,7,,,4,2,1,2,2,1,1,1,7,1,1,1,1,1,1,0,1,0,1,1,1,4,1,4,1,2,,2,1,,45,2
5,4,501,1,1,1,1,102,1,1,1,3,1,14,6,2,3,,0,0,,4,1,3,4,3,1,3,2,2,1,2,3,,2,,,,,2,2,4,4,4,4,2,3,5,2,,2,4,2,,2,0,,0,,,4,0,1,2,2,2,2,1,1,1,1,2,2,1,2,,1,3,3,3,3,4,5,3,3,6,3,3,2,5,5,4,3,2,7,7,1,7,4,5,3,6,2,4,3,2,6,7,2,3,3,6,7,2,1,10,10,5,1,7,1,2,3,1,3,6,1,9,6,6,7,8,2,1,3,2,4,2,2,1,2,0,0,,0,,,,0,0,0,0,2,2,8,8,1,8,1,1,1,,3,2,,2,,4,,,5,0,6,4,7,3,2,,2,2,7,24,5,8,,,4,2,3,2,1,2,1,1,7,1,1,0,0,0,0,0,0,0,1,0,0,13,,,,,,3,1,,50,1
5,5,501,1,1,1,1,102,1,1,1,3,1,14,6,2,4,3,8,0,8,1,1,3,4,3,3,3,2,2,2,2,3,,2,,,,,1,4,4,4,4,4,1,3,3,1,3,2,3,3,1,2,0,1,1,4,0,4,2,2,2,1,1,1,2,2,2,2,1,1,2,2,,1,1,1,1,3,2,1,2,3,4,5,2,1,2,4,6,2,3,2,1,2,5,1,1,1,1,1,2,3,4,2,1,1,3,2,3,1,2,3,10,2,8,5,1,1,3,10,2,10,9,2,1,4,2,10,8,7,8,2,2,4,1,1,1,1,0,0,,0,,,,,0,0,0,1,2,8,1,1,8,2,2,,3,,2,,2,,3,2,,5,0,2,3,3,2,2,1,2,2,11,23,1,2,,,3,2,2,1,1,2,1,1,7,1,1,1,0,0,0,0,0,0,1,0,0,2,1,3,1,2,,3,1,,35,1
5,6,501,1,1,1,1,102,1,1,1,3,1,14,6,1,3,32,0,0,,3,2,4,4,3,2,4,2,2,2,2,3,,2,,,,,4,4,3,4,4,4,2,2,6,2,3,2,2,2,2,2,1,2,0,,,2,0,2,2,1,2,1,2,2,2,2,2,1,2,2,,2,3,4,1,2,4,7,4,3,2,6,6,7,6,4,5,6,7,4,6,6,7,6,6,5,6,6,3,4,3,5,2,2,3,7,6,6,2,1,7,9,6,8,4,4,3,9,2,5,5,5,6,5,4,4,3,3,3,2,2,3,2,1,2,1,0,0,,0,0,,,,0,0,1,2,1,8,8,2,8,1,1,3,,3,2,,2,,4,2,,5,0,1,5,6,6,2,2,2,2,8,21,1,2,,,4,1,2,1,0,1,1,1,7,1,1,0,1,0,0,0,0,0,1,0,0,9,1,4,1,2,,2,1,,46,1
5,7,501,1,1,1,1,102,1,1,1,3,1,14,6,2,1,,0,0,,3,3,4,4,4,2,4,3,2,2,2,3,,2,,,,,2,2,4,4,4,4,1,3,4,2,,2,2,3,2,2,0,1,0,,,2,3,2,2,2,1,2,2,2,2,,2,2,1,2,,1,4,2,1,4,3,7,6,3,4,5,6,1,2,6,3,5,7,1,2,6,7,5,4,1,7,7,1,3,2,5,5,2,3,5,6,1,3,2,8,9,2,2,1,2,2,1,1,4,3,2,1,1,6,4,2,3,1,2,2,4,2,1,1,2,0,0,,0,,,,0,0,0,0,2,8,8,8,8,8,1,1,2,,3,2,,2,,2,1,3,5,2,2,7,3,4,2,,2,2,4,59,1,3,,,3,2,4,6,5,2,2,1,7,1,1,0,0,0,0,0,0,0,1,0,0,13,,,,,,2,1,,52,5
5,8,501,1,1,1,2,201,1,2,1,3,1,14,6,1,14,,0,0,,3,3,2,4,3,3,3,2,2,2,2,3,,2,,,,,1,4,4,4,4,4,1,2,5,2,2,2,3,3,1,2,0,1,1,2,1,3,1,2,1,1,1,1,2,2,2,2,1,2,2,2,,1,1,1,1,3,3,2,1,2,1,2,3,4,1,2,3,4,7,1,2,2,3,1,1,2,1,1,3,3,4,7,2,1,3,3,2,3,1,1,7,4,10,1,1,1,6,4,1,3,2,1,1,1,4,9,9,10,1,2,1,4,2,1,2,2,0,0,,0,,,,,0,1,1,1,1,1,1,1,8,1,2,,6,,1,1,1,1,1,1,3,4,3,2,7,1,3,2,2,2,2,11,20,1,5,,,4,2,2,1,0,2,1,1,7,1,1,1,0,0,0,0,0,0,1,0,0,12,,,,,,1,1,,50,1
5,9,501,1,1,1,2,201,1,2,1,3,1,14,6,2,3,3,19,0,3,1,2,4,4,4,2,3,2,2,2,2,3,,2,,,,,1,2,4,4,4,4,1,1,3,1,2,2,2,4,2,1,0,3,1,3,1,4,3,1,1,1,1,1,2,2,2,2,2,1,1,2,,1,2,1,2,1,4,6,3,2,4,2,5,6,4,3,5,2,5,3,6,5,7,5,6,3,4,5,3,3,2,4,1,1,3,6,7,6,3,3,6,9,8,6,5,4,2,8,3,3,2,1,1,1,7,7,2,8,1,1,2,2,2,1,2,1,0,0,0,0,,,0,0,0,0,0,3,1,8,8,2,8,1,1,1,,3,2,,1,1,3,1,3,4,3,2,2,2,1,2,,2,2,11,28,1,4,5,1,1,2,2,3,1,2,2,1,7,1,1,0,0,1,0,0,0,0,1,0,0,13,,,,,,2,1,,38,2
5,10,501,1,1,1,2,201,1,2,1,3,1,14,6,2,4,3,18,32,32,1,1,4,4,5,3,5,3,2,2,2,3,,1,2,1,2,2,3,4,4,4,4,3,1,3,1,,3,2,3,,1,2,0,0,0,,,4,0,2,2,1,1,1,2,2,2,2,2,1,2,2,,2,3,1,4,4,3,7,4,1,5,3,4,7,7,3,,1,7,7,4,7,7,6,7,6,7,6,1,2,1,1,3,1,3,3,6,7,3,3,9,9,9,1,1,1,1,8,1,8,10,1,1,1,1,9,10,9,1,2,2,2,1,1,2,2,0,0,,0,,,,,0,0,0,1,1,8,1,2,1,1,1,2,,3,2,,1,2,1,1,3,4,2,7,7,1,7,2,2,2,2,4,72,1,2,2,2,4,2,3,2,8,1,1,1,7,1,1,1,0,0,0,0,0,0,1,1,0,13,,,,,,3,1,,46,6
5,11,501,1,1,1,2,201,1,2,1,3,1,14,6,1,70,26,3,6,6,3,1,3,4,3,2,4,2,2,2,2,3,,1,2,1,1,2,1,2,4,4,4,4,1,1,10,2,4,2,4,2,2,2,0,1,1,2,1,3,1,2,2,2,2,2,1,1,2,1,1,2,2,2,,1,2,1,1,3,5,7,5,6,7,5,4,6,3,5,4,6,7,,5,4,7,6,5,5,6,5,5,6,6,7,5,4,3,7,7,7,2,2,6,10,10,1,1,1,1,6,1,9,8,1,1,1,6,7,6,10,,2,2,2,1,1,3,2,0,0,0,0,0,,,0,0,0,0,1,1,8,1,1,1,1,1,1,,1,1,1,1,3,1,,,1,0,1,5,1,3,2,2,2,2,9,47,1,5,,,4,1,2,2,3,2,1,1,7,1,1,1,1,1,0,0,1,1,1,1,1,5,2,,,,8,1,1,,60,4
5,12,501,1,1,1,2,201,1,2,1,3,1,14,6,1,3,19,26,3,19,3,1,2,4,5,3,4,3,2,2,2,3,,1,1,2,2,2,1,4,3,4,4,1,2,2,7,1,2,2,2,3,,2,0,0,1,3,1,4,0,2,2,1,2,1,1,1,2,1,1,1,1,1,1,2,2,1,3,3,3,6,2,1,4,1,2,6,3,6,3,6,5,2,1,2,7,4,3,2,5,3,2,4,4,4,4,2,2,6,7,7,4,2,6,6,5,3,1,1,1,1,1,4,2,1,2,1,8,8,6,5,5,2,2,1,2,1,2,2,1,1,,0,1,,,,0,0,0,1,1,1,1,2,1,1,2,,6,,2,,1,4,1,1,3,1,4,2,2,1,6,1,1,2,1,11,25,5,7,8,1,1,1,4,2,0,2,1,1,7,1,1,1,1,1,0,0,0,0,1,0,0,9,2,,,,8,2,2,2,46,1
5,13,501,1,1,1,2,201,1,2,1,3,1,14,6,2,3,29,13,6,13,1,1,3,4,2,2,2,2,2,2,2,1,1,1,2,1,1,2,1,2,3,4,4,4,1,3,6,2,2,2,3,2,2,2,0,2,1,2,0,2,0,2,2,2,2,2,1,1,2,1,2,2,1,1,3,2,3,3,1,3,3,1,2,3,1,3,1,7,6,1,3,5,4,1,7,7,7,6,5,3,2,1,1,7,6,5,4,1,2,1,7,7,2,2,10,5,3,1,1,3,1,2,5,1,8,6,5,3,1,8,6,7,10,2,2,2,2,1,3,3,0,0,,0,0,,,,0,0,0,1,1,1,1,1,1,1,2,,2,,2,,2,,4,2,,5,0,4,1,1,1,2,2,2,2,15,24,1,3,,,4,2,2,3,1,2,2,1,7,1,1,1,0,1,0,0,0,1,1,1,0,12,,,,,,2,1,,39,1
5,14,501,1,1,1,3,902,1,3,1,3,1,14,6,2,4,,0,0,,3,1,4,4,5,3,4,3,2,2,2,3,,2,,,,,4,2,4,4,4,4,2,4,1,2,4,1,4,4,2,2,0,0,1,4,0,4,0,1,1,1,1,1,2,1,2,2,2,2,2,2,,2,3,1,4,4,3,5,5,4,4,1,1,1,1,1,1,1,1,1,1,1,3,1,1,1,1,1,3,3,1,1,1,1,5,7,1,7,3,4,10,10,10,10,1,1,10,10,1,1,1,10,10,1,10,2,1,2,1,3,1,4,2,2,2,1,0,0,,0,,,,0,1,0,1,1,8,8,8,8,8,1,2,,2,,2,,1,2,4,1,3,5,2,1,7,1,7,2,2,2,2,2,33,1,3,,,4,2,4,1,3,2,2,1,7,1,1,0,0,1,0,0,0,0,0,0,0,13,,,,,,2,1,,35,2
5,15,501,1,1,1,3,902,1,3,1,3,1,14,6,2,59,27,13,19,19,2,1,3,4,4,2,4,3,2,2,2,3,,2,,,,,1,2,3,4,4,4,1,2,7,2,2,2,3,3,2,2,0,1,0,,,4,1,1,2,1,1,1,1,1,1,1,1,1,1,1,1,1,2,1,4,3,7,7,3,2,7,2,4,5,1,5,5,2,7,2,4,2,7,4,5,5,6,5,4,6,7,6,4,3,3,4,7,7,4,2,10,10,5,1,1,1,1,9,1,1,10,1,1,1,10,10,10,10,9,2,2,4,2,1,1,1,0,0,,0,0,,0,,0,0,0,1,1,8,1,2,8,1,2,,14,,2,,1,3,2,1,1,5,3,1,1,1,1,2,2,2,2,15,22,1,3,,,4,2,2,1,0,2,2,1,7,1,1,1,1,1,0,0,1,0,1,0,0,1,1,1,3,1,,1,1,,50,1
5,16,501,1,1,1,3,902,1,3,1,3,1,14,6,2,4,,0,0,,4,4,4,4,4,3,4,3,2,2,2,3,,2,,,,,1,4,4,4,4,4,3,3,10,2,3,2,3,4,4,1,0,2,0,,,4,3,2,2,1,1,1,2,2,2,2,2,2,2,2,,1,3,1,1,3,3,2,1,1,1,1,1,1,1,1,1,1,1,1,1,1,1,1,1,1,1,1,1,1,1,1,1,1,3,4,3,2,3,3,7,7,10,3,1,1,1,1,1,1,1,1,1,1,5,3,2,3,1,2,2,4,2,2,2,2,0,0,,0,,,0,,0,0,0,1,8,8,8,8,8,1,1,1,,3,1,1,1,1,4,1,3,5,3,2,1,1,1,2,2,2,2,0,70,1,2,,,4,2,3,1,3,1,1,1,7,1,0,0,0,1,0,0,0,0,1,0,0,13,,,,,,1,1,,36,6
5,17,501,1,1,1,3,902,1,3,1,3,1,14,6,1,5,18,0,0,,4,1,4,4,3,1,5,3,2,2,2,3,,2,,,,,4,4,4,4,4,4,2,1,,2,3,2,3,,2,2,0,0,1,4,0,4,2,1,1,1,1,1,,,2,2,2,2,2,2,,1,2,2,4,4,3,2,3,5,5,6,2,7,5,6,6,5,2,2,2,3,7,3,3,5,6,1,5,6,1,6,6,6,3,7,7,5,1,3,10,10,4,1,1,1,1,1,1,8,8,2,2,2,8,8,8,8,1,2,1,4,2,1,1,1,0,0,,0,,,,,0,0,0,2,8,8,8,8,8,3,2,,6,,2,,2,,4,1,3,5,0,4,5,1,2,2,2,2,2,8,16,5,,,,1,1,,1,0,1,1,1,7,1,1,1,0,1,0,0,0,0,1,0,0,12,,,,,,2,1,,34,1
5,18,501,1,1,1,3,902,1,3,1,3,1,14,6,1,1,7,15,3,7,3,1,4,4,4,3,4,3,2,2,2,3,,2,,,,,2,2,4,4,4,4,3,3,6,2,4,2,3,,1,2,0,0,1,3,0,3,0,2,2,2,2,2,2,2,1,1,1,1,1,2,,2,4,1,3,2,4,3,3,3,3,6,2,6,1,1,3,6,7,1,2,5,7,4,4,4,1,1,1,3,2,4,4,1,3,7,7,5,4,4,1,8,3,1,1,1,3,4,1,4,4,1,1,1,7,7,6,6,1,3,2,4,2,1,3,1,0,0,,0,,,,0,0,0,0,1,8,8,8,2,8,1,2,,3,,2,,2,,4,2,,5,0,5,4,2,6,2,2,2,2,0,50,1,3,,,,2,3,2,8,2,2,1,7,1,1,0,0,0,0,0,0,0,1,0,0,,2,,,,48,1,1,,30,4
5,19,501,1,1,1,3,902,1,3,1,3,1,14,6,2,5,,0,0,,1,4,4,4,4,3,1,1,2,2,2,3,,1,1,1,1,1,1,4,4,4,4,4,1,2,3,2,4,2,3,2,2,2,0,0,0,,,4,1,1,1,1,1,1,,,,,2,2,2,2,,1,3,1,2,2,5,1,3,4,2,3,1,1,2,4,3,6,2,4,2,3,7,5,3,1,1,1,1,1,2,5,1,3,,3,4,5,3,3,3,1,10,8,1,1,1,3,2,1,,,,,5,6,3,1,1,,,4,2,1,2,2,0,1,,0,0,,0,,0,0,0,1,1,8,8,2,8,1,2,,3,,2,,2,,4,,,5,,1,2,1,1,1,1,1,1,9,26,5,1,,,4,2,3,1,1,2,1,1,7,1,1,0,0,1,0,0,0,0,1,1,0,10,1,4,1,2,,3,1,,35,2
5,20,501,1,1,1,3,902,1,3,1,3,1,14,6,1,3,,0,0,,1,1,3,4,3,2,2,2,1,2,2,3,,1,2,1,2,2,1,4,4,4,4,2,1,1,7,2,2,2,2,2,2,2,0,2,0,,,4,3,1,1,1,1,1,1,1,1,1,2,2,1,2,,2,2,1,1,1,7,4,6,7,3,3,5,2,6,7,6,1,7,1,3,1,7,4,5,6,7,4,7,3,2,4,5,7,3,6,7,2,3,3,9,10,2,10,1,3,7,10,1,9,1,1,10,10,2,2,3,1,1,3,1,4,2,1,3,1,0,0,,0,0,,,,0,1,1,2,1,8,8,1,8,1,1,1,,3,1,1,1,1,1,1,3,3,1,7,5,7,7,2,2,2,2,6,22,1,3,,,4,2,3,1,0,1,1,1,7,1,1,1,0,1,0,0,0,0,1,1,1,10,1,2,5,1,,1,1,,30,1
5,21,501,2,1,2,6,102,1,6,1,3,1,14,6,1,59,26,8,19,26,1,1,2,4,4,3,4,3,2,2,2,3,,2,,,,,1,4,4,2,4,4,3,1,8,2,2,2,2,3,2,2,0,2,0,,,3,2,1,1,1,1,1,2,2,2,1,1,2,2,2,,2,1,1,4,4,7,7,4,3,5,3,2,7,2,4,3,1,6,1,2,6,7,4,5,3,7,4,6,2,7,5,6,1,3,4,7,1,3,3,2,10,5,1,2,1,1,7,1,5,1,2,10,5,9,8,10,8,1,2,2,4,2,1,1,1,0,0,,0,0,,,,0,0,0,1,1,1,1,2,1,1,1,1,,3,1,1,1,4,4,1,1,4,4,4,2,6,2,2,2,2,2,15,25,1,3,,,4,2,2,1,1,1,1,1,7,1,1,0,0,1,0,0,0,0,1,0,0,7,1,4,1,2,,2,1,,40,1
5,22,501,2,1,2,6,102,1,6,1,3,1,14,6,2,1,3,26,0,26,2,1,4,4,2,2,4,3,2,2,2,3,,2,,,,,4,4,4,4,4,4,2,3,4,2,3,2,2,2,2,2,0,0,0,,,1,3,1,1,1,1,1,1,2,2,2,2,1,2,2,,1,3,1,1,3,7,7,2,7,6,1,1,2,3,1,2,1,5,1,1,7,7,3,2,5,7,7,3,4,5,2,1,1,2,6,6,2,3,2,7,5,3,8,9,1,10,1,2,5,3,1,2,1,4,3,7,3,7,2,2,2,2,1,1,1,0,0,0,0,,,,,0,0,0,2,1,1,1,1,8,1,1,1,,2,1,1,1,3,1,1,1,3,3,3,5,2,6,2,2,2,2,10,22,1,4,,,4,2,3,2,1,2,2,1,7,1,1,1,1,1,1,0,0,0,1,0,0,13,,,,,,1,1,,50,1
5,23,501,2,1,2,6,102,1,6,1,3,1,14,6,2,3,27,23,24,27,2,1,4,4,3,2,3,1,1,2,2,3,,2,,,,,4,4,4,4,4,2,1,1,8,2,3,2,2,3,2,2,0,0,0,,,3,1,1,1,2,1,1,2,2,1,2,2,1,1,2,,1,1,1,3,3,4,6,4,4,3,3,4,3,4,2,3,3,7,4,4,3,6,4,4,3,3,4,3,4,4,3,4,2,3,4,6,4,3,3,4,8,4,3,3,4,3,3,3,5,3,6,7,7,4,6,4,5,5,1,2,4,2,2,2,1,0,0,,0,0,,,,0,0,0,1,1,8,8,2,8,1,1,2,,3,2,,1,2,3,1,3,2,2,1,1,1,2,2,2,2,2,11,18,1,8,6,1,1,2,2,1,0,2,1,1,7,1,1,1,1,1,0,0,0,0,1,1,0,4,1,2,1,2,,2,1,,40,1
5,24,501,2,1,2,6,102,1,6,1,3,1,14,6,1,3,3,14,20,20,1,1,1,3,4,3,3,1,2,2,2,3,,1,1,2,1,1,1,2,4,2,4,1,1,1,4,1,3,2,,2,2,1,0,2,1,1,1,2,2,2,2,1,2,1,2,2,2,2,2,2,1,2,,1,1,1,1,4,6,7,6,7,7,6,7,7,7,5,5,6,7,5,1,6,7,5,4,5,4,6,3,3,2,3,3,1,4,5,6,4,4,2,9,10,4,1,1,1,1,2,1,1,5,1,1,1,3,3,6,8,10,,2,1,2,1,1,1,1,0,0,0,0,0,0,,0,0,0,1,1,1,1,2,1,1,1,2,,2,1,2,1,2,1,1,2,1,2,1,1,1,1,1,1,2,2,16,25,1,8,,,4,2,2,2,0,2,1,1,7,1,1,1,1,1,0,0,1,0,1,1,1,1,1,4,1,2,,2,2,1,32,1
5,25,501,2,1,2,6,102,1,6,1,3,1,14,6,2,3,0,0,0,,3,2,3,3,3,2,3,2,2,2,2,3,,2,,,,,1,4,4,4,4,4,2,2,1,2,2,,3,,2,2,0,,1,2,1,3,1,2,2,2,2,2,2,2,2,2,2,2,1,2,,2,1,2,2,2,2,2,5,2,2,2,2,5,1,1,,2,7,1,,1,7,,2,3,6,2,1,3,1,3,3,1,4,6,6,4,3,2,10,10,8,1,1,1,3,1,1,7,7,1,1,1,8,8,8,8,10,2,2,4,2,1,3,1,0,0,0,0,,,,,0,0,0,3,8,8,8,8,8,1,1,,,3,1,,2,,3,,,4,0,1,1,1,7,1,1,2,2,12,64,1,4,,,4,2,2,3,2,2,2,1,7,1,1,0,0,1,0,0,0,0,1,0,0,13,,,,,,1,1,,41,5
5,26,501,2,1,2,6,102,1,6,1,3,1,14,6,2,14,,0,0,,4,3,4,4,5,3,4,3,2,2,2,3,,2,,,,,3,4,4,4,4,4,2,3,10,2,4,2,3,4,,2,0,0,0,,,4,0,2,2,2,2,2,2,1,2,2,2,2,1,2,,2,4,1,1,2,7,5,1,1,7,4,1,1,1,1,5,1,1,1,1,1,7,1,3,1,5,1,1,1,1,1,1,1,4,3,1,3,3,4,2,9,8,3,1,1,1,3,1,7,4,3,5,7,7,4,1,3,2,1,2,4,2,2,1,1,0,0,,0,0,,,0,0,0,0,2,8,8,8,1,8,1,2,,,,2,,1,1,3,2,,4,,1,6,2,4,2,2,2,2,1,50,4,3,,,4,2,4,4,4,2,2,1,1,1,0,0,0,0,0,0,0,0,0,0,0,4,1,4,1,2,,3,2,3,36,4
5,27,501,2,1,2,6,102,1,6,1,3,1,14,6,1,4,26,13,2,26,1,2,4,4,5,3,4,3,2,2,2,3,,2,,,,,2,4,2,2,4,4,2,2,10,2,3,2,,,1,2,0,1,0,,,3,2,2,2,2,2,2,2,2,2,2,2,2,2,2,,2,2,1,2,3,3,2,2,6,1,7,7,7,7,7,7,7,7,7,2,3,5,5,3,2,1,1,4,5,5,6,6,7,4,4,5,3,3,3,8,9,3,7,7,7,1,1,2,4,5,7,7,7,8,7,4,5,4,3,,3,2,1,2,3,0,0,,0,,,,,0,0,0,1,1,8,1,1,8,1,2,,,,2,,1,1,2,1,3,4,3,3,2,2,2,2,2,2,2,6,50,5,3,,,4,2,3,1,2,2,2,1,7,1,1,0,1,1,0,0,0,0,1,1,0,5,1,4,1,2,,2,1,,30,4
5,28,501,2,1,2,7,305,1,7,1,3,1,14,6,1,3,3,27,0,27,3,1,4,4,3,2,3,2,2,2,2,3,,2,,,,,1,4,4,4,4,4,2,2,4,2,2,2,3,3,1,1,0,2,0,,,3,2,1,2,2,2,2,2,2,1,1,1,1,1,2,,2,2,3,2,4,5,5,5,5,5,6,3,7,6,6,,7,7,,,6,7,,,,6,5,1,1,1,1,1,1,4,6,6,,2,3,10,10,7,2,1,1,3,3,1,10,10,4,2,2,8,9,9,8,1,2,2,4,2,1,1,1,0,0,,0,,0,,,0,0,0,2,1,2,1,2,8,2,2,,10,,2,,1,2,3,1,3,5,2,3,1,3,3,2,2,2,2,8,16,1,1,,,4,2,2,1,0,2,2,1,7,1,1,0,0,0,0,0,0,0,0,0,0,12,,,,,,2,1,,35,1
5,29,501,2,1,2,7,305,1,7,1,3,1,14,6,1,3,27,0,0,,3,2,4,4,5,2,3,2,2,2,2,3,,2,,,,,1,4,4,4,4,4,2,3,6,1,2,2,3,2,2,2,0,0,1,2,1,3,1,2,2,2,2,2,,,2,2,2,1,2,2,,1,4,2,2,3,2,2,2,1,1,,6,7,,2,,6,6,1,,2,7,,,,7,7,1,3,4,4,4,1,3,6,6,6,2,2,8,8,8,1,1,1,1,3,1,1,1,1,1,1,6,6,6,6,1,2,2,4,2,1,2,1,0,0,,0,0,,,,0,0,0,,1,8,8,8,8,1,2,,3,,2,,2,,4,2,,5,0,1,4,4,6,2,2,2,2,6,22,1,1,,,4,2,4,1,0,2,2,1,1,1,1,0,0,0,0,0,0,0,1,0,0,5,1,2,1,2,,2,1,,40,1
5,30,501,2,1,2,7,305,1,7,1,3,1,14,6,1,57,,0,0,,1,3,3,4,4,3,3,3,2,2,2,3,,2,,,,,4,4,4,4,4,2,2,3,9,2,3,2,4,4,2,2,0,1,0,,,2,2,1,1,1,1,1,1,1,,2,,2,2,2,,1,1,2,4,4,4,5,1,3,2,1,7,4,2,3,4,2,1,2,3,1,7,5,6,3,2,1,5,6,3,4,2,1,3,5,3,4,3,3,8,9,10,8,5,3,8,2,1,4,3,5,1,2,3,4,1,10,10,,,3,2,1,2,2,0,0,,0,0,,,0,0,1,1,2,1,8,1,2,8,2,1,2,,3,2,,1,2,3,1,3,4,2,1,1,1,5,2,2,2,2,3,44,4,0,,,4,2,4,2,4,2,2,1,7,1,0,0,0,0,0,0,0,0,1,1,0,5,1,4,1,2,,2,1,,30,3
5,31,501,2,1,2,7,305,1,7,1,3,1,14,6,1,10,,0,0,,1,1,4,4,3,3,3,2,2,2,2,3,,2,,,,,1,4,4,4,4,2,1,1,6,2,4,2,3,4,2,2,0,1,0,,,4,0,,2,2,2,2,1,1,,,,,,2,,1,3,1,2,1,1,2,3,4,6,7,5,1,1,1,2,1,3,4,5,6,7,3,5,1,1,1,1,2,5,6,1,1,3,4,2,5,,2,1,3,5,4,3,2,1,1,1,10,10,2,3,1,2,3,5,2,1,,,4,2,1,2,2,0,0,,0,,0,0,,0,0,0,1,8,8,8,8,8,1,1,1,,1,1,1,1,4,2,1,1,4,3,1,3,1,3,2,2,2,2,6,65,1,7,,,4,1,2,2,0,2,2,1,7,1,0,1,0,0,0,0,0,0,1,0,0,4,1,4,1,2,,2,1,,37,5
5,32,501,2,1,2,7,305,1,7,1,3,1,14,6,2,15,,0,0,,1,2,4,4,3,2,3,2,2,2,2,3,,2,,,,,1,2,2,4,4,4,2,2,5,2,2,2,3,3,1,2,0,2,0,,,3,2,1,1,1,1,1,2,2,1,2,2,2,2,2,,2,3,2,1,4,7,6,2,1,3,4,7,6,5,4,2,1,7,2,3,7,7,3,2,1,7,1,2,3,5,1,2,4,3,2,4,1,3,4,10,10,7,9,2,1,8,10,6,2,4,1,2,2,7,3,6,1,2,2,2,4,2,1,2,1,0,0,,0,,,,,0,0,0,1,8,2,1,2,1,1,1,1,,2,1,1,1,1,3,1,2,5,1,2,6,1,4,2,2,2,2,6,54,5,3,,,4,2,4,1,8,1,1,1,7,1,1,0,0,0,0,0,0,0,0,0,0,13,,,,,,1,1,,42,4
5,33,501,2,1,2,7,305,1,7,1,3,1,14,6,2,4,26,1,27,27,3,1,3,4,3,3,3,3,2,2,2,3,,2,,,,,4,4,3,4,4,4,1,1,1,2,3,2,2,2,2,2,0,1,0,,,3,3,2,2,1,2,1,1,1,2,2,2,2,2,2,,1,2,1,1,3,7,6,1,7,7,5,5,6,7,7,7,6,7,7,2,7,7,7,7,6,7,7,6,7,6,7,4,5,2,6,7,7,3,2,10,10,10,9,6,4,1,4,3,5,8,9,6,8,7,9,7,6,9,3,2,4,2,2,3,2,0,0,,0,0,0,,,0,0,0,2,8,2,1,1,8,1,1,1,,3,1,1,2,,4,1,3,3,3,1,7,1,7,2,2,2,2,12,20,1,6,,,4,2,2,1,1,2,2,1,7,1,1,1,0,1,0,0,0,1,1,1,0,2,1,1,2,1,,2,1,,39,1
5,34,501,2,1,2,7,305,1,7,1,3,1,14,6,2,4,,0,0,,1,1,3,4,3,3,3,3,2,2,2,3,,2,,,,,4,2,4,4,4,4,2,3,8,2,4,,2,4,,,0,2,0,,,4,2,2,2,2,2,2,2,2,2,2,2,2,2,2,,2,3,3,2,4,7,2,3,3,3,5,1,1,1,1,1,1,1,1,1,1,1,1,1,1,1,1,4,5,5,6,7,7,2,4,4,5,3,3,8,7,7,1,1,1,1,3,4,3,4,3,2,1,5,6,3,3,1,2,2,4,2,2,1,2,0,0,,0,,,,,0,0,1,1,1,8,1,1,8,1,1,2,,3,1,2,1,2,2,1,3,4,2,2,3,2,4,2,2,2,2,11,26,5,5,,,4,1,3,3,2,1,1,1,7,1,1,0,0,1,0,0,0,1,1,0,0,13,,,,,,1,1,,37,2
5,35,501,3,1,3,9,102,1,12,1,4,1,14,6,1,4,2,27,0,27,2,3,3,4,4,3,4,1,1,2,2,3,,2,,,,,2,4,4,1,4,4,1,2,3,2,4,2,3,2,2,2,0,0,1,2,1,3,2,2,1,1,2,1,2,2,2,2,1,2,2,2,,2,1,1,1,3,2,6,2,3,4,5,3,7,4,5,4,7,7,2,6,2,1,1,1,4,7,4,4,3,5,6,5,3,4,3,4,6,1,1,8,4,6,2,2,2,1,10,1,10,7,10,8,10,7,10,8,6,2,2,2,3,2,1,1,3,0,0,,0,,,,0,1,1,1,1,8,8,1,1,8,1,2,,6,,1,2,1,2,1,1,2,4,2,2,4,4,3,2,1,2,2,6,19,1,3,,,4,2,3,1,0,2,2,1,7,1,0,0,0,0,0,0,0,0,0,0,0,6,1,4,1,2,,1,1,,32,1
5,36,501,3,1,3,9,102,1,12,1,4,1,14,6,1,3,32,15,4,32,3,3,3,4,5,2,3,2,2,2,2,3,,2,,,,,3,4,4,4,4,4,1,1,7,2,3,2,3,2,3,1,0,0,0,,,3,1,2,2,2,2,2,2,2,2,2,2,1,1,2,,2,3,2,3,4,5,7,4,4,6,6,5,5,5,5,4,5,7,1,5,2,7,4,5,5,6,6,3,5,2,5,5,4,3,7,4,2,2,1,6,9,6,1,1,1,1,1,1,8,2,1,1,1,7,5,2,2,,2,2,4,2,1,1,1,0,0,,0,0,,,0,0,0,0,3,1,8,1,2,8,1,1,1,,,2,,2,,4,2,,4,0,1,3,1,4,2,2,2,2,6,29,1,,,,1,2,2,1,2,2,2,1,7,1,1,1,0,1,0,0,0,0,1,0,0,4,1,4,1,2,,2,1,,45,2
5,37,501,3,1,3,9,102,1,12,1,4,1,14,6,1,30,26,6,32,26,1,1,2,4,4,3,2,2,2,1,2,1,1,1,1,1,1,1,4,2,2,4,4,2,2,3,4,2,3,1,1,2,2,1,0,1,0,,,3,3,2,2,2,2,1,2,1,1,2,2,2,2,2,,1,3,1,1,1,3,6,4,4,4,3,2,4,3,2,2,4,3,2,2,5,7,4,3,4,4,2,1,1,2,2,2,1,2,2,3,3,2,3,9,10,10,1,2,1,1,9,1,2,4,3,5,5,6,7,6,6,1,1,1,1,2,1,1,1,0,1,,0,0,,0,,0,0,1,1,1,2,2,2,8,1,1,2,,3,1,2,1,2,3,1,3,3,2,4,4,2,6,2,2,2,2,11,42,4,4,,,2,1,3,2,6,1,1,1,7,1,1,1,0,1,0,0,0,1,1,0,0,9,1,1,3,1,,1,2,3,39,3
5,38,501,3,1,3,9,102,1,12,1,4,1,14,6,2,3,3,11,19,3,1,1,4,4,5,3,3,1,1,1,2,3,,1,2,2,1,2,1,2,3,4,4,4,2,1,10,1,3,1,5,3,1,2,0,0,1,3,1,4,2,2,2,1,2,2,1,1,2,2,2,2,1,2,,2,4,1,3,4,1,7,4,6,3,1,1,5,4,4,3,1,7,7,1,2,7,3,6,4,5,2,1,6,6,5,3,1,3,7,7,1,2,2,10,10,10,10,1,1,1,1,1,2,2,1,4,4,4,2,1,1,1,2,2,4,2,1,2,1,0,0,,0,0,,0,0,0,0,0,3,1,8,2,2,8,1,1,1,,3,2,,1,1,2,1,3,3,1,1,1,1,5,1,,2,2,8,30,1,5,,,1,2,4,2,3,2,1,1,7,1,1,1,0,0,0,0,0,0,1,0,0,9,1,4,1,2,,2,1,,40,2
5,39,501,3,1,3,9,102,1,12,1,4,1,14,6,2,3,3,0,0,,2,1,3,4,5,3,3,3,2,2,2,3,,2,,,,,1,4,4,4,4,4,2,3,8,2,3,1,3,3,1,,0,1,0,,,4,2,1,1,1,1,1,1,1,1,2,2,2,1,2,,2,1,1,3,4,4,6,3,2,6,2,2,3,2,2,4,6,7,3,4,2,6,5,5,4,2,2,2,2,5,2,2,1,3,3,6,3,3,3,3,9,4,3,2,2,2,2,2,3,2,3,3,5,3,6,5,7,2,2,2,4,2,2,2,1,0,0,,0,,,,,0,1,1,1,8,8,8,8,8,1,1,1,,2,1,1,1,1,3,1,1,4,3,2,2,2,1,2,2,2,2,11,22,1,1,8,2,1,2,3,1,0,2,2,1,7,1,1,0,0,0,0,0,0,0,1,1,0,9,2,,,,24,2,1,,42,1
5,40,501,3,1,3,9,102,1,12,1,4,1,14,6,2,4,1,17,0,1,1,3,4,4,4,2,5,2,2,2,2,,,2,,,,,3,4,4,4,4,2,1,4,7,2,4,2,4,4,2,2,0,0,1,3,1,4,0,2,2,2,2,2,2,2,2,2,2,2,2,2,,2,1,1,1,4,5,6,6,2,4,5,4,3,3,2,2,1,6,1,3,1,7,4,3,3,4,5,2,2,1,1,1,1,3,5,6,5,2,3,6,10,9,8,9,7,7,6,5,3,2,5,4,5,8,4,4,4,4,2,2,3,2,1,1,1,0,0,0,0,0,,0,,0,0,0,1,1,8,2,1,8,1,2,,6,,1,2,1,2,2,1,3,3,1,1,1,2,1,1,2,2,1,7,19,1,2,,,4,1,4,1,0,2,2,1,7,1,0,0,0,0,0,0,0,0,0,0,0,8,1,4,1,2,,1,1,,32,1
5,41,501,3,1,3,9,102,1,12,1,4,1,14,6,2,4,1,0,0,,3,1,3,4,3,3,3,2,1,2,2,3,,2,,,,,1,4,4,4,4,4,1,2,,2,3,2,3,2,2,2,0,1,1,2,1,3,2,2,2,2,2,1,2,2,2,2,2,1,2,2,,2,3,3,1,4,1,1,2,3,4,5,6,7,,,1,2,3,4,5,1,2,3,4,5,6,7,1,2,3,4,1,1,4,2,1,3,3,3,2,1,2,4,3,2,1,2,3,2,1,3,4,1,10,10,9,8,1,2,2,3,2,1,1,2,0,0,,1,,1,1,1,0,0,1,1,1,8,8,1,8,1,2,,7,,1,2,1,2,3,1,2,4,2,2,4,3,2,2,2,2,2,0,62,1,1,,,4,2,4,2,2,2,2,1,7,1,1,0,0,0,0,0,0,0,0,0,0,13,,,,,,1,1,,41,5
5,42,501,5,1,5,13,305,1,9,1,3,1,13,6,1,13,26,3,10,10,1,1,4,4,4,3,3,2,2,2,2,3,,2,,,,,4,2,4,4,4,4,2,,8,2,4,2,1,4,2,2,0,1,0,,,4,0,2,2,2,2,2,2,2,,,,,,1,1,2,3,1,4,4,7,7,,1,3,4,3,1,1,2,4,1,7,1,1,3,7,1,3,1,5,4,1,6,2,1,1,3,4,3,4,2,3,2,10,10,10,1,1,1,1,5,1,8,8,1,1,1,10,8,10,10,10,2,2,1,2,1,1,1,1,1,,0,0,,,0,0,0,0,1,1,8,1,2,1,1,1,1,,1,1,1,2,,4,1,,2,3,2,3,2,4,1,1,1,1,11,42,1,8,8,3,3,2,2,2,2,1,1,1,7,1,1,1,1,1,0,1,1,0,1,1,1,4,1,4,1,2,,2,1,,53,3
5,43,501,5,1,5,13,305,1,9,1,3,1,13,6,1,4,,0,0,,1,1,4,4,3,3,3,3,2,2,1,3,,2,,,,,1,2,4,4,4,2,1,1,6,2,3,1,3,3,2,2,0,0,0,,,4,0,2,2,1,1,1,2,2,,,2,,,2,,2,3,3,4,1,6,3,4,3,5,3,3,4,3,3,4,5,6,2,2,1,7,3,4,3,4,6,5,4,3,5,2,2,3,6,7,2,2,3,7,8,9,1,1,1,1,1,1,5,4,3,1,1,6,5,1,1,1,2,2,4,2,1,2,3,1,0,,0,0,0,,,0,0,0,3,8,8,8,8,8,2,2,,14,,2,,2,,4,2,,5,0,1,7,1,1,2,2,2,2,7,25,1,4,,,4,2,3,3,1,2,2,1,7,1,1,1,1,1,0,1,0,0,1,1,0,2,2,,,,4,3,1,,32,1
5,44,501,5,1,5,13,305,1,9,1,3,1,13,6,2,4,16,20,10,20,1,3,1,4,3,3,3,3,2,2,2,3,,2,,,,,1,4,4,4,4,4,2,3,6,,2,,4,4,2,2,0,1,0,,,3,2,2,2,2,2,2,2,2,2,2,2,2,2,2,,2,3,3,3,3,3,,,2,2,1,1,1,1,1,1,1,1,2,2,3,1,1,1,1,1,1,4,4,2,1,1,1,4,4,4,4,,2,8,2,4,4,5,6,3,3,3,4,5,5,4,4,5,6,7,4,4,2,2,3,2,2,1,1,0,0,,0,,,,,0,0,1,1,8,1,1,1,8,1,1,2,,3,1,2,1,2,3,1,3,3,2,3,4,1,1,2,2,2,2,15,34,1,5,,,4,2,4,2,2,2,2,1,7,1,1,1,1,1,0,0,0,0,1,1,0,13,,,,,,2,1,,33,2
5,45,501,5,1,5,13,305,1,9,1,3,1,13,6,2,3,27,4,0,27,2,1,3,4,5,3,3,2,2,2,2,3,,1,2,1,2,2,4,4,4,4,4,4,1,1,,2,3,2,,,1,1,0,,0,,,,1,2,2,2,2,2,1,2,2,1,2,2,2,2,,2,1,2,,3,,,,,,,,7,,,2,3,,1,,,7,2,2,2,6,2,1,1,1,1,1,1,3,6,5,6,2,3,5,5,1,1,1,1,1,1,1,1,1,1,1,1,6,5,5,2,10,2,2,4,2,1,2,2,0,0,,0,1,,,,0,0,0,1,1,2,1,1,2,1,1,1,,3,1,1,1,1,3,1,1,3,1,4,4,4,4,2,2,2,2,14,29,1,5,,,4,2,2,1,2,2,2,1,7,1,1,0,0,1,0,0,0,0,1,0,0,1,1,4,1,2,,3,1,,50,2
5,46,501,5,1,5,13,305,1,9,1,3,1,13,6,2,59,23,3,20,3,1,4,4,4,4,3,3,1,2,2,2,1,3,2,,,,,1,4,4,4,4,4,2,2,8,2,3,2,3,3,2,1,0,1,1,2,1,3,1,2,2,2,2,2,1,1,2,1,2,1,2,2,,2,2,2,2,2,6,6,3,3,4,4,3,4,3,4,3,4,3,3,3,5,7,5,5,5,6,3,3,5,3,3,3,3,3,7,6,6,3,2,10,10,10,1,1,1,1,3,1,1,1,2,1,1,6,6,5,5,10,2,2,2,1,1,2,1,0,0,0,0,,,,,0,0,0,1,1,2,8,2,1,2,2,,6,,2,,,,2,1,1,3,4,4,4,4,5,2,2,2,2,11,16,1,6,,,4,2,2,1,0,1,1,1,7,1,1,1,1,1,1,0,0,0,1,1,1,12,,,,,,3,1,,40,1
5,47,501,5,1,5,13,305,1,9,1,3,1,13,6,2,59,,0,0,,1,2,4,4,4,3,4,3,2,2,2,3,,2,,,,,4,2,4,4,2,4,2,3,,2,2,2,3,2,2,2,0,2,0,,,3,2,2,1,1,1,2,2,2,2,2,2,1,2,2,,1,1,2,2,4,6,7,5,3,1,2,3,5,1,1,3,1,2,2,1,5,7,2,4,5,6,2,1,2,3,1,1,1,3,4,6,5,3,4,6,8,9,1,1,3,1,7,1,5,7,5,8,2,7,9,8,3,1,3,2,4,2,1,2,1,0,0,,0,,,,,0,0,0,1,1,8,1,1,8,1,1,1,,3,1,1,2,,3,2,,5,0,1,1,7,6,2,2,2,2,6,60,5,3,,,4,2,3,6,7,4,4,2,2,2,1,1,1,1,0,1,1,0,1,1,0,13,,,,,,3,1,,50,5
5,48,501,5,1,5,13,305,1,9,1,3,1,13,6,1,4,1,11,0,1,1,3,3,4,3,3,3,3,2,2,2,3,,2,,,,,4,2,4,4,4,4,2,3,5,2,3,2,3,3,2,1,0,1,0,,,3,1,1,1,1,1,1,1,1,2,2,2,2,1,2,,1,4,1,1,1,3,7,6,5,2,3,2,4,2,6,5,7,7,4,3,2,7,6,7,6,7,3,3,4,5,1,3,2,3,4,6,5,2,2,6,8,9,1,1,1,1,8,4,3,2,5,4,4,7,8,7,3,2,1,2,3,2,1,1,2,0,0,,0,0,,,,0,0,0,1,1,8,8,8,8,1,1,1,,3,1,1,2,,4,1,3,4,3,2,6,1,5,2,2,2,2,10,23,1,4,,,4,1,3,3,1,2,2,1,7,1,1,0,0,0,0,0,1,0,1,0,0,7,2,,,,5,3,1,,40,1
5,49,501,5,1,5,14,1002,1,10,1,3,1,13,6,2,1,,0,0,,3,3,4,4,4,2,4,2,2,2,2,3,,2,,,,,1,2,4,4,4,4,1,2,,2,4,2,,,3,2,0,0,1,4,0,4,0,2,2,2,2,,,,2,2,2,2,2,2,,2,4,1,3,2,2,1,1,1,1,1,2,2,1,1,1,1,1,2,3,4,7,1,3,4,2,3,1,1,2,1,1,1,4,,7,1,,,10,10,1,1,1,1,1,8,1,10,10,8,2,1,,5,2,1,5,1,2,4,2,1,2,1,1,0,1,0,0,,,1,0,0,1,1,9,8,1,1,1,1,1,77,,1,2,,2,,4,2,,5,0,2,4,1,1,2,2,2,2,11,40,4,10,,,4,2,1,2,3,2,2,1,7,1,1,1,1,1,0,0,0,0,1,1,1,9,1,1,3,1,,3,1,,43,3
5,50,501,5,1,5,14,1002,1,10,1,3,1,13,6,2,3,,0,0,,1,1,1,4,4,1,2,3,2,2,2,3,,2,,,,,2,2,2,4,4,4,2,4,5,2,3,2,,3,2,2,0,0,1,2,1,4,2,2,2,1,1,1,1,2,2,1,2,2,2,1,1,1,4,1,2,1,1,7,6,5,4,6,7,7,6,5,4,7,1,1,7,7,7,3,6,3,2,1,5,6,5,7,2,2,3,1,7,5,2,2,10,10,7,1,1,1,1,1,1,8,7,1,4,1,10,1,1,1,1,2,2,4,2,1,2,2,0,0,0,0,,0,0,0,0,0,0,2,2,8,8,2,8,1,1,1,,3,1,1,2,,3,1,3,4,2,1,2,1,1,2,,2,2,9,19,1,4,,,4,2,4,1,0,1,2,1,7,1,1,0,0,0,0,0,0,0,1,0,0,12,,,,,,3,1,,41,1
5,51,501,5,1,5,14,1002,1,10,1,3,1,13,6,2,3,1,15,29,15,1,1,3,4,2,2,3,2,2,2,2,3,,1,1,1,2,2,1,2,4,4,4,4,2,1,3,2,3,2,3,3,2,2,0,1,0,,,3,1,2,2,2,2,2,2,2,2,2,1,2,,1,6,2,3,1,3,3,4,7,3,3,2,3,3,5,2,5,5,5,4,1,2,3,7,3,3,4,6,4,4,4,4,4,5,3,3,7,7,5,3,3,1,10,1,1,1,1,1,2,1,6,1,1,2,1,5,9,9,9,1,2,2,4,2,1,2,2,0,0,,0,0,,0,0,0,0,0,1,1,8,8,2,1,1,1,1,,3,1,1,2,,4,2,,4,0,1,1,5,4,2,2,2,2,10,25,2,2,,,4,2,3,2,3,2,2,1,7,1,1,0,0,1,0,0,0,0,1,1,0,13,,,,,,1,1,,45,1
5,52,501,5,1,5,14,1002,1,10,1,3,1,13,6,1,15,3,12,0,12,1,1,3,4,5,2,4,3,2,2,2,3,,1,2,1,1,2,1,4,1,2,4,4,3,2,5,1,3,2,2,3,1,2,0,2,0,,,1,3,2,2,1,2,1,1,2,2,2,2,2,1,1,6,1,3,1,1,3,3,1,1,2,3,1,1,2,3,4,5,6,7,1,2,3,1,2,1,1,7,1,1,1,1,1,1,1,5,2,3,4,4,4,1,2,1,2,3,4,5,2,3,1,2,3,2,1,4,9,8,9,1,2,2,3,2,1,1,3,0,0,,0,,,1,1,0,0,0,1,1,8,1,1,8,1,1,2,,1,1,2,1,2,1,1,3,1,2,3,4,3,3,2,2,2,2,6,50,1,6,,,4,1,3,3,3,2,1,1,7,1,1,0,0,0,0,0,0,0,1,0,0,7,1,4,1,2,,1,1,,50,4
5,53,501,5,1,5,14,1002,1,10,1,3,1,13,6,1,4,3,7,0,7,3,1,3,4,3,2,3,2,2,2,2,3,,2,,,,,4,4,4,4,4,4,3,2,1,2,4,2,3,3,2,1,0,0,1,2,1,2,2,2,2,1,2,2,2,2,2,2,2,1,1,2,,2,3,2,1,2,1,2,3,4,5,4,6,1,4,1,3,4,5,1,2,3,2,1,1,1,1,2,7,1,7,7,7,1,3,5,7,1,3,2,10,10,10,1,1,1,1,1,1,1,10,10,1,1,1,10,1,1,1,2,2,4,2,1,1,1,0,0,,0,,,,,0,0,1,1,1,2,8,1,8,1,1,2,,2,2,,2,,3,2,,4,2,1,1,1,1,2,2,2,2,10,22,5,1,,,3,1,3,1,0,2,2,1,7,1,1,0,0,1,0,0,0,0,1,1,0,9,1,3,3,2,,3,1,,46,1