PAIS,IDNUM,ESTRATOPRI,UPM,MEXESTADO,MEXMUNICIPIO,MEXDISTRITO,MEXSECELET,SEC,CLUSTER,UR,TAMANO,MEXIDIOMA,DIA,MES,Q1,A4,DEM13A,DEM13B,DEM13C,DEM13D,A1,A2,A3,A4I,SOCT1,SOCT2,IDO1,IDIO2,CP2,CP4A,CP4,PROT1,PROT2,CP5,CP5A,CP5B,CP5C,CP5D,CP6,CP7,CP8,CP9,CP10,CP13,LS3,IT1,L1,NP1,NP1B,NP2,SGL1,SGL2,LGL2,LGL3,JC1,JC4,JC10,JC12,JC13,JC15,JC16,POP1,POP2,POP3,POP4,POP5,VIC1,VIC2,AOJ8,AOJ11,AOJ11A,AOJ12,B1,B2,B3,B4,B6,B10A,B11,B12,B13,B14,B16,B18,B20,B21,B31,B32,B43,B37,N1,N3,N9,N10,N11,N12,M1,ING4,PN2,DEM23,PN4,PN5,E5,E8,E11,E15,E14,E2,E3,E16,D32,D33,D34,D36,D37,D1,D2,D3,D4,D5,DEM2,AUT1,PP1,PP2,DC1,DC10,DC13,EXC2,EXC6,EXC11,EXC13,EXC14,EXC15,EXC16,EXC17,EXC18,EXC19,EXC7,GI1,GI2,GI3,GI4,GI5,VB1,VB2,MEXVB3,VB4,VB8,VB6,MEXVB7,VB10,MEXVB11,POL1,POL2,AA1,AA2,AA3,AA4,DIS2,DIS3,DIS4,DIS5,MEX7,MEX10,MEX18,MEX19,MEX20,MEX22,MEX23,MEX24,MEX25,MEX26,MEX27,MEX28,MEX29,MEX30,MEX31a,MEX31b,MEX31c,MEX31d,MEX31e,MEX31f,MEX31g,MEX31h,MEX31O,ED,Q2,Q3,Q10,Q10A,Q10B,Q10C,Q14,Q10D,Q11,Q12,MEXETID,MEXETIDA,MEXLENG1,MEXLENG1O,MEXLENG1A,MEXLENG4,R1,R3,R4,R4A,R5,R6,R7,R8,R12,R14,R15,OCUP1,OCUP4,OCUP1A,OCUP1B1,OCUP1C,DESOC2,MIG1,MIG2,MIG3,TI,filter__
1,1,102,1,1,1,2,80,0,1,1,3,1,24,6,2,3,17,2,0,17,1,1,4,4,4,2,4,2,2,2,2,3,,2,,,,,3,4,4,4,4,4,1,3,5,2,3,2,3,3,2,2,2,2,2,2,2,2,2,2,2,1,1,1,2,,2,2,2,4,7,4,5,3,4,3,4,6,3,5,4,3,5,3,4,5,7,3,3,3,2,3,2,2,3,5,7,5,3,2,10,10,8,6,1,1,1,1,1,1,1,1,1,5,7,6,5,7,2,1,4,2,1,1,1,0,0,,,,,,0,0,0,1,1,8,1,1,8,1,2,,10,,2,,1,1,3,3,1,1,1,1,2,2,2,2,2,1,5,5,5,2,4,1,2,2,2,8,8,1,,,,,,,,,,14,19,1,3,,,1,2,2,1,0,2,1,1,9,9,1,1,1,1,1,2,1,0,0,1,1,1,12,,,,,,3,1,,50,0
1,2,102,1,1,1,2,80,0,1,1,3,1,24,6,1,3,17,0,0,,1,1,1,4,2,1,2,1,2,2,2,3,,1,2,1,1,2,2,2,2,2,4,4,2,3,5,2,2,2,2,2,1,1,2,2,2,2,2,1,1,1,1,2,1,1,1,7,2,4,1,4,5,7,5,5,6,5,7,5,4,5,3,4,5,4,6,6,7,7,6,5,6,5,6,6,2,4,5,4,2,2,7,6,6,1,1,1,1,1,8,8,9,4,3,9,8,9,7,9,2,1,3,2,1,2,1,1,0,0,0,1,0,0,0,0,0,1,1,2,8,1,8,1,1,1,,1,2,,1,1,2,2,1,7,7,7,2,2,2,2,2,,2,3,3,,4,1,3,1,1,10,1,1,,,,,,,,,,5,53,1,3,,,4,2,3,2,3,1,1,1,9,9,1,1,1,1,0,2,1,0,0,1,1,0,6,1,4,1,2,,3,1,,42,0
1,3,102,1,1,1,2,80,0,1,1,3,1,24,6,1,27,14,0,0,,3,2,2,4,4,3,4,2,2,2,2,3,,2,,,,,4,4,4,4,4,4,1,4,4,2,4,,3,3,3,2,1,1,2,2,1,2,2,1,2,2,2,1,2,,1,,2,2,7,6,3,5,6,3,7,5,4,5,1,1,7,2,3,6,7,7,5,4,3,2,2,4,3,6,4,3,2,2,4,3,3,2,1,1,1,1,6,7,9,6,10,7,6,5,7,7,2,2,4,2,1,2,2,1,1,,0,,,,0,1,0,3,1,8,1,1,8,1,2,,10,,2,,2,,4,4,4,2,5,7,2,2,2,2,5,1,5,4,4,2,4,1,3,1,2,8,3,1,,,,,,,,,,9,19,1,9,,,4,1,1,1,0,1,1,1,9,9,1,1,1,1,1,3,1,1,0,1,1,0,12,,,,,,3,1,,31,0
1,4,102,1,1,1,2,80,0,1,1,3,1,24,6,2,3,1,14,17,14,1,2,3,4,3,2,3,2,2,2,2,3,,2,,,,,1,2,4,4,4,4,2,2,5,2,3,,3,3,3,2,2,2,2,2,2,2,2,2,2,2,2,2,2,,1,1,2,1,6,7,7,6,7,6,7,7,4,7,7,6,7,6,6,7,7,5,6,7,7,7,7,6,2,4,5,6,2,2,7,8,8,2,1,1,1,1,5,1,4,1,2,5,5,4,5,5,2,2,4,2,1,2,1,0,0,,,,,,0,0,0,1,1,8,1,1,8,1,1,1,,1,1,1,1,1,1,1,1,1,1,1,2,2,2,2,4,1,3,3,3,2,4,3,4,3,3,9,9,1,,,,,,,,,,9,47,1,6,,,4,2,3,2,4,2,2,1,9,9,1,1,1,1,1,0,1,0,0,1,1,1,13,,,,,,3,1,,53,0
1,5,102,1,1,1,2,80,0,1,1,3,1,24,6,1,3,3,0,0,,1,1,4,4,3,2,3,2,2,2,2,3,,2,,,,,3,4,4,4,4,4,1,3,5,2,3,,3,3,4,2,2,2,2,2,2,2,2,1,2,2,2,1,1,2,1,3,1,3,6,7,5,2,6,6,6,6,6,5,5,4,5,3,5,2,6,6,6,4,4,4,4,4,3,5,5,3,2,2,5,6,5,3,1,1,1,1,1,1,1,2,3,5,4,5,5,9,2,2,2,2,1,1,1,0,0,,,,,,0,0,0,1,1,8,1,1,8,1,2,,10,,1,3,2,,4,2,1,1,1,1,1,1,1,1,4,2,3,3,3,2,2,2,2,1,2,7,7,1,,,,,,,,,,16,22,1,7,,,4,1,2,1,0,4,1,1,9,9,1,1,1,1,0,1,1,0,0,1,1,1,12,,,,,,3,1,,40,0
1,6,102,1,1,1,2,80,0,1,1,3,1,24,6,2,3,,0,0,,2,2,4,4,3,,3,2,2,2,2,3,,2,,,,,1,4,4,4,4,4,2,3,,2,,2,3,,,2,2,2,2,2,2,,,,2,2,2,2,2,,1,3,2,3,6,7,6,7,6,5,5,7,,,7,5,7,1,6,5,7,,5,5,5,5,5,5,2,5,4,3,2,2,8,8,6,1,1,1,1,1,4,3,4,3,2,5,5,5,5,5,2,2,3,,1,1,1,1,0,,,,,,0,0,1,2,1,2,1,1,8,1,2,,14,,1,1,2,,4,5,3,3,2,2,2,2,2,2,2,2,3,3,3,2,4,3,3,3,3,7,7,1,,,,,,,,,,0,73,1,2,,,1,2,4,6,10,2,2,1,9,9,1,1,1,1,0,0,1,0,0,1,1,0,14,,,,,,1,1,,42,0
1,7,102,1,1,1,2,80,0,2,1,3,1,25,6,2,27,,0,0,,2,1,3,2,5,3,3,3,2,2,1,1,1,1,2,1,1,1,4,2,2,1,3,1,1,2,4,1,3,2,3,3,,,1,1,1,1,1,,,2,1,,1,,2,,2,2,1,2,6,5,6,5,6,5,6,4,5,5,5,4,3,5,5,5,6,6,5,4,4,5,5,5,3,4,6,4,2,2,9,10,8,9,3,1,2,2,2,2,1,1,1,2,7,6,6,8,2,2,4,2,1,2,1,1,1,,,,,,0,0,0,1,1,1,1,1,8,1,1,1,,3,2,,1,3,1,2,1,2,1,1,2,1,1,1,5,1,2,4,4,,4,2,2,1,1,9,8,1,,,,,,,,,,2,24,1,2,,,4,2,4,2,2,2,2,1,9,9,1,1,1,1,0,0,1,0,0,1,1,0,13,,,,,,3,1,,55,0
1,8,102,1,1,1,2,80,0,2,1,3,1,25,6,2,3,,0,0,,1,2,4,2,4,3,4,3,2,2,1,2,2,2,,,,,1,2,1,3,1,3,2,2,8,2,,2,,4,,,,1,,,1,,,2,,,1,,2,,1,4,1,3,5,7,5,5,7,5,7,7,7,7,7,7,7,7,7,7,7,7,5,6,6,6,6,6,3,5,3,5,2,2,8,9,8,6,3,1,1,1,2,3,2,1,1,7,6,6,6,9,2,2,4,2,1,1,1,1,0,,,,0,0,0,0,1,2,8,8,8,2,8,1,1,2,,3,1,2,2,,3,4,1,2,1,1,2,1,2,2,4,,3,3,3,,4,2,2,1,2,7,6,1,,,,,,,,,,6,30,1,2,,,4,1,4,2,3,2,2,1,9,9,1,1,1,0,0,0,0,0,0,1,1,0,13,,,,,,3,1,,30,0
1,9,102,1,1,1,2,80,0,2,1,3,1,25,6,2,25,17,0,0,,3,2,4,4,4,3,4,3,2,2,1,3,,1,2,1,1,1,1,3,3,2,3,4,2,2,8,2,3,,3,3,,,2,2,,,,,2,2,2,2,2,,2,,2,2,1,2,4,6,5,4,5,5,7,6,6,5,5,,7,3,6,6,7,5,5,4,1,2,2,3,2,2,5,4,2,2,9,8,8,6,2,1,1,1,1,2,1,1,1,8,8,8,7,9,2,2,4,2,1,1,1,1,0,0,,,1,,0,0,0,,1,8,1,1,8,,1,,,3,1,,2,,3,,1,1,1,1,2,1,2,1,5,1,2,3,3,,4,3,3,2,2,7,7,1,,,,,,,,,,9,47,1,4,,,4,2,3,2,5,1,1,1,9,9,1,1,1,1,1,0,1,1,0,1,1,0,13,,,,,,3,1,,40,0
1,10,102,1,1,1,2,80,0,2,1,3,1,25,6,1,4,13,0,0,,3,2,4,4,4,2,3,2,,,,2,1,2,,,,,1,1,1,2,1,3,2,2,6,2,,2,,3,,,,2,,2,,2,,,2,,,,1,1,1,3,3,3,3,6,5,5,6,4,6,3,2,4,4,3,6,4,4,5,6,6,3,3,2,4,3,3,3,4,6,6,2,2,6,7,6,6,3,2,1,1,2,2,2,1,1,9,9,7,6,9,1,,4,2,1,2,1,0,0,,0,,,,0,0,,,1,8,1,1,8,,1,1,,3,2,,2,,3,,2,3,1,2,2,2,2,2,4,1,,3,3,2,4,2,3,2,3,8,8,1,,,,,,,,,,12,30,1,4,,,4,2,2,1,0,2,2,1,9,9,1,1,1,1,0,0,1,0,0,1,1,1,11,1,2,5,1,,3,1,,38,0
1,11,102,1,1,1,2,80,0,2,1,3,1,25,6,1,3,,0,0,,2,1,2,4,3,2,3,2,,,,3,,2,,,,,4,4,4,4,4,4,2,3,5,2,2,1,2,3,3,2,2,2,2,2,2,2,2,2,2,1,2,1,2,,1,3,4,3,3,7,6,4,7,3,6,7,6,5,6,4,7,4,6,7,7,5,3,3,7,7,5,3,3,3,4,3,2,2,6,6,6,3,3,3,1,1,4,3,3,6,4,5,6,5,7,8,3,1,2,2,1,1,1,1,0,,,,,,0,1,0,3,8,2,1,1,2,1,2,,10,,2,,1,2,3,,4,5,3,5,2,1,2,2,2,2,2,3,3,2,4,2,3,1,3,5,5,1,,,,,,,,,,0,22,1,4,,,4,2,3,3,2,2,2,1,9,9,1,1,0,0,1,0,0,0,0,1,1,0,4,1,4,5,1,,1,1,,45,0
1,12,102,1,1,1,2,80,0,2,1,3,1,25,6,1,1,,0,0,,1,2,3,4,3,2,3,2,2,2,2,3,,2,,,,,3,4,,2,4,4,3,4,5,2,3,2,3,3,,2,2,2,2,2,2,2,2,2,2,2,2,2,1,1,2,4,1,4,2,7,2,1,5,1,5,3,1,3,3,2,5,3,2,3,7,7,1,2,1,3,2,1,3,5,7,4,2,2,10,10,8,2,1,1,1,1,3,2,2,2,2,6,5,5,5,5,,2,4,2,1,1,2,1,0,0,0,0,0,0,0,1,0,3,1,8,1,1,8,1,1,1,,3,1,1,1,1,4,4,4,5,1,1,2,2,2,2,3,2,3,3,3,2,4,2,1,2,2,10,5,1,,,,,,,,,,6,47,1,5,,,4,2,3,2,5,2,1,1,9,9,1,1,1,1,0,2,1,0,0,1,1,0,4,1,4,1,2,,1,1,,45,0
1,13,102,2,1,11,1,484,0,1,2,5,1,28,6,1,15,32,0,0,,1,2,3,4,3,2,3,2,1,1,1,3,,2,,,,,4,4,4,4,4,4,2,2,8,2,,,,,,2,2,2,2,2,2,2,2,2,2,2,2,,2,,1,2,2,4,1,1,2,1,1,1,2,1,1,2,1,1,7,1,1,3,7,6,1,2,1,1,1,1,4,5,4,5,2,2,6,7,7,3,7,1,1,1,3,4,2,1,1,5,5,5,5,5,2,2,1,2,1,1,1,0,0,,,,,,0,0,0,1,1,8,8,1,8,1,1,2,,3,1,2,1,2,2,2,3,5,4,4,2,1,2,2,2,2,2,5,2,2,4,4,4,1,3,1,5,1,,,,,,,,,,6,62,1,2,,,4,2,4,2,0,2,2,1,9,1,1,1,1,0,0,0,1,0,0,1,1,0,5,2,,,,,1,1,,30,0
1,14,102,2,1,11,1,484,0,1,2,5,1,28,6,1,27,13,14,0,14,3,1,2,4,3,3,2,2,2,2,2,3,,1,1,2,1,1,4,2,4,4,4,4,2,2,5,1,3,2,3,3,3,2,1,1,1,2,2,1,1,2,1,2,1,2,2,,2,2,1,3,7,7,7,7,7,7,7,7,7,7,7,6,7,5,7,7,7,1,7,7,6,7,7,7,1,1,7,,3,3,9,10,6,1,1,1,1,4,2,2,1,1,1,4,1,6,4,9,1,2,4,2,1,2,3,0,0,,0,,,0,0,1,1,1,1,1,1,1,1,1,1,1,,1,1,1,2,,2,3,2,1,1,7,2,2,2,1,3,1,1,4,3,2,4,4,4,4,4,10,10,1,,,,,,,,,,12,36,1,6,,,4,2,3,2,4,1,2,1,9,1,1,1,1,1,0,3,1,1,0,1,1,0,4,1,3,1,1,,2,1,,33,0
1,15,102,2,1,11,1,484,0,1,2,5,1,28,6,2,1,14,0,0,,1,3,2,4,5,2,3,2,2,2,2,3,,1,2,1,1,1,1,2,2,2,1,1,1,4,9,2,3,2,,3,4,2,2,1,1,2,2,1,2,1,1,2,2,2,2,,1,2,2,4,7,7,7,7,7,7,6,7,7,7,7,7,7,6,6,7,7,6,7,6,7,6,7,2,1,7,7,1,2,2,9,10,9,1,1,1,1,1,1,1,1,1,1,3,10,8,4,10,2,2,4,2,1,2,1,0,0,,,,,,0,1,0,2,8,8,8,1,8,1,1,1,,3,1,1,1,1,1,2,3,1,1,1,2,1,2,2,4,1,4,5,3,2,4,2,3,3,3,6,1,1,,,,,,,,,,9,29,1,5,,,1,2,,2,3,1,1,1,9,1,1,1,1,1,1,0,1,0,0,1,1,0,13,,,,,,3,1,,30,0
1,16,102,2,1,11,1,484,0,1,2,5,1,28,6,2,3,,0,0,,3,2,2,3,3,2,3,1,2,2,2,3,,2,,,,,1,2,3,4,3,4,1,2,5,2,3,2,3,2,4,2,2,1,1,2,1,2,2,2,2,2,1,2,2,,1,2,2,3,6,7,1,1,1,2,2,3,2,2,2,1,7,1,3,2,7,6,1,6,5,6,4,5,3,6,7,3,2,2,8,9,8,1,1,1,1,3,1,2,2,1,1,10,8,7,4,3,2,2,4,2,1,2,1,0,0,,,,0,0,0,0,0,2,1,8,9,1,8,1,1,1,,3,2,,1,1,2,4,1,1,1,1,2,1,1,2,2,1,,3,2,1,4,2,3,1,1,7,5,1,,,,,,,,,,9,24,1,3,,,4,2,3,2,2,2,1,1,9,1,1,1,1,1,0,0,0,0,0,1,1,0,13,,,,,,1,1,,44,0
1,17,102,2,1,11,1,484,0,1,2,5,1,28,6,2,58,1,0,0,,1,1,3,4,3,2,3,3,1,1,2,3,,2,,,,,1,2,4,4,4,4,1,1,5,2,2,,3,3,3,,2,2,2,2,2,2,2,2,,1,2,2,2,,,2,2,3,,5,5,6,7,7,7,6,6,6,5,3,7,5,5,5,7,7,6,6,5,6,6,4,1,5,4,5,2,2,7,8,9,1,1,1,1,1,4,5,3,1,1,5,4,5,6,7,2,,3,2,1,1,1,1,0,,,,,,0,0,0,1,1,8,1,1,8,1,1,,,3,2,,2,,2,2,5,4,2,2,2,2,2,2,3,2,3,3,3,2,4,4,2,1,1,10,10,1,,,,,,,,,,9,36,1,0,,,4,2,3,6,6,1,1,1,9,1,1,1,1,1,0,0,1,0,0,1,1,0,13,,,,,,2,1,,30,0
1,18,102,2,1,11,1,484,0,1,2,5,1,28,6,2,3,,0,0,,1,1,3,4,3,2,3,2,2,1,2,3,,2,,,,,2,2,4,4,4,4,2,2,7,2,3,,3,3,3,2,2,2,2,2,2,2,2,2,2,2,2,2,2,,1,2,1,4,2,3,,4,2,5,6,7,2,3,4,1,7,1,3,4,7,5,2,3,2,1,2,1,4,4,5,4,3,3,6,7,6,1,1,1,1,1,4,3,4,4,4,5,5,5,5,5,3,2,3,2,1,1,1,0,0,,,,,,0,0,0,1,1,8,1,1,8,1,1,,,1,1,,2,,4,5,3,4,5,3,2,2,2,2,3,1,2,5,3,2,4,3,2,3,2,8,6,1,,,,,,,,,,6,30,1,0,,,4,2,,2,8,2,2,1,9,1,1,1,1,1,0,0,1,0,0,1,1,0,13,,,,,,1,1,,30,0
1,19,102,2,1,11,1,484,0,2,2,5,1,28,6,1,58,1,13,0,13,2,1,4,4,3,2,3,2,2,2,2,3,,2,,,,,2,2,4,4,4,4,2,2,6,2,3,2,5,4,4,,2,1,1,2,2,2,2,2,,,,,2,,,2,2,2,7,6,,5,6,6,6,6,6,6,6,7,6,6,6,6,7,5,6,6,6,6,5,6,2,3,2,3,3,2,5,6,6,2,1,1,2,1,3,2,3,2,1,5,4,3,5,8,3,,3,2,1,1,1,0,0,,,,,,0,0,0,1,8,1,2,1,8,2,2,,10,,2,,1,1,2,2,3,5,2,2,2,2,2,2,2,2,3,,5,2,4,3,3,2,2,6,6,1,,,,,,,,,,10,18,1,6,2,2,1,2,2,1,0,2,2,1,9,1,1,1,1,1,1,3,1,0,0,1,1,0,11,1,2,1,2,,2,1,,31,0
1,20,102,2,1,11,1,484,0,2,2,5,1,28,6,2,58,1,13,0,13,1,2,4,4,3,,3,2,2,2,2,3,,1,2,2,2,2,2,2,4,4,4,4,2,2,5,2,3,,2,3,3,2,2,2,2,2,2,2,2,1,2,1,2,2,2,,2,2,2,3,7,5,,6,5,6,5,6,6,6,6,7,7,4,3,4,7,5,2,1,3,2,1,1,4,5,6,4,2,2,6,7,7,3,1,2,2,1,3,4,3,2,1,5,4,5,5,7,3,1,3,2,1,1,1,0,0,,,,,,0,0,0,,1,2,1,2,8,1,1,,,3,1,,2,,4,5,3,2,2,1,2,1,2,2,2,1,,2,5,2,4,2,3,2,2,5,5,1,,,,,,,,,,12,50,1,2,2,1,4,2,2,2,4,1,1,1,9,1,1,1,1,1,0,2,1,1,0,1,1,1,13,,,,,,1,1,,32,0
1,21,102,2,1,11,1,484,0,2,2,5,1,28,6,2,1,1,8,18,1,3,2,4,4,3,2,3,3,2,2,2,3,,2,,,,,1,4,4,4,4,4,1,2,7,2,3,2,3,3,,2,2,1,2,2,2,2,,,1,2,2,2,2,,1,1,2,2,7,6,6,6,6,6,6,6,6,6,5,4,7,6,6,6,6,6,6,7,6,5,6,6,2,5,4,5,2,,,5,6,2,2,1,2,1,2,2,2,2,1,7,7,7,7,7,2,2,4,2,1,1,1,0,0,,,,,,0,0,0,2,1,8,1,1,1,2,2,,10,,1,1,2,,2,1,1,3,3,3,2,2,2,2,3,2,3,3,3,2,4,3,3,3,3,8,7,1,,,,,,,,,,9,22,1,2,,,4,2,,1,0,1,1,1,9,1,1,1,1,0,0,0,1,0,0,1,1,0,11,1,2,1,2,,2,1,,30,0
1,22,102,2,1,11,1,484,0,2,2,5,1,28,6,1,4,15,0,0,,1,2,2,4,3,2,3,2,2,2,2,3,,2,,,,,1,4,4,4,4,4,2,1,6,2,,2,3,3,2,2,2,1,1,2,2,,2,2,2,2,2,,2,,1,2,2,4,7,5,6,5,6,6,6,6,6,6,6,5,7,4,6,6,7,5,6,6,6,5,4,2,3,7,6,5,2,2,10,9,2,2,2,1,2,1,3,4,2,2,1,5,5,8,5,9,2,2,4,2,1,2,1,1,0,,,,,0,0,0,0,1,1,8,1,1,9,1,1,,,3,1,,2,,2,3,2,1,1,1,2,2,2,2,,,3,3,3,,4,3,2,2,3,9,6,1,,,,,,,,,,12,39,1,10,,,4,1,,2,3,2,2,1,9,1,1,1,1,1,1,3,1,1,1,1,1,1,9,1,2,1,1,,2,1,,35,0
1,23,102,2,1,11,1,484,0,2,2,5,1,28,6,1,58,,0,0,,1,1,3,4,3,2,3,3,2,2,2,3,,2,,,,,2,4,4,4,4,4,1,1,6,2,,2,,,,,2,2,2,2,2,,,2,,,2,2,2,,1,1,1,3,,6,5,4,3,7,6,6,6,,,5,7,2,,7,7,5,5,6,5,6,5,3,3,7,5,7,2,2,7,6,8,1,1,1,1,1,3,3,3,3,3,,,7,7,6,2,2,3,2,1,1,1,0,0,,,,,,0,0,0,2,1,2,1,1,8,1,1,,,3,1,,2,,3,4,2,4,2,1,2,2,2,2,,2,,3,3,2,4,4,3,2,2,8,8,1,,,,,,,,,,11,25,1,10,10,1,1,2,2,2,1,2,2,1,9,1,1,1,1,1,1,3,1,1,1,1,1,1,,2,,,,3,2,1,,39,0
1,24,102,2,1,11,1,484,0,2,2,5,1,28,6,1,1,14,1,17,17,1,1,2,4,3,2,2,2,2,2,2,3,,1,2,,1,1,1,,,,,,1,1,7,2,2,2,3,3,3,2,2,2,2,2,2,,1,1,,,2,2,2,,2,2,2,4,7,5,,6,7,5,6,6,7,5,7,4,7,4,7,5,7,5,6,7,5,4,5,5,3,7,6,7,2,2,9,10,9,1,1,1,1,1,3,2,1,1,2,9,7,7,5,8,2,2,2,2,1,1,1,0,0,,0,0,,0,0,0,0,1,8,1,2,1,8,1,1,1,,3,1,,2,,3,3,2,2,1,1,2,2,2,2,3,2,,3,3,,4,3,2,2,2,9,8,1,,,,,,,,,,15,42,1,8,,,4,2,,2,4,1,1,1,9,1,1,1,1,1,0,1,1,1,0,1,1,1,5,1,3,1,2,,1,1,,35,0
1,25,101,3,2,4,6,772,0,1,1,2,1,28,6,2,5,3,17,31,17,4,1,4,4,4,2,4,3,2,2,2,3,,2,,,,,3,4,4,4,4,4,3,2,9,2,4,2,4,2,2,2,2,1,1,2,1,2,2,2,2,1,1,2,1,1,2,2,1,4,4,5,4,4,4,4,4,6,5,4,4,4,4,3,4,4,7,6,5,,1,4,4,5,3,7,7,4,3,3,1,8,8,1,1,1,1,10,6,7,2,5,2,4,2,1,1,9,2,2,4,2,1,2,1,0,0,,,,,,0,0,0,2,1,8,1,1,1,1,1,2,,2,2,,1,7,2,2,1,1,1,5,1,2,2,2,5,1,5,3,,2,4,2,2,2,2,9,8,1,,,,,,,,,,12,24,1,9,,,4,1,4,1,2,2,1,1,9,9,1,1,1,0,1,0,1,1,0,1,1,0,13,,,,,,3,1,,45,0
1,26,101,3,2,4,6,772,0,1,1,2,1,28,6,1,5,3,10,15,10,3,1,3,4,4,3,3,3,2,2,2,3,,2,,,,,1,4,4,4,4,4,2,3,8,2,3,2,3,3,2,2,2,2,1,2,1,2,2,2,2,2,1,2,2,,1,2,1,3,3,5,3,4,2,1,5,5,4,4,3,2,5,3,3,4,7,7,2,6,1,4,3,3,3,7,7,5,3,2,8,8,6,3,2,2,1,2,7,3,6,7,3,6,6,7,6,2,2,2,4,2,1,1,1,0,0,,0,,,,0,0,0,1,1,9,2,1,8,1,2,,12,,1,1,1,,2,4,1,1,1,4,1,2,2,1,5,1,3,4,,2,4,2,3,1,3,8,6,1,,,,,,,,,,9,37,1,8,,,4,1,3,2,3,2,2,1,9,9,1,1,1,0,1,0,1,0,0,1,1,0,10,1,2,5,1,,3,1,,40,0
1,27,101,3,2,4,6,772,0,2,1,2,1,28,6,2,5,3,15,0,3,3,1,4,4,3,2,3,2,2,2,2,3,,2,,,,,1,2,4,4,4,4,2,3,8,2,2,2,3,2,2,2,2,2,1,2,1,2,2,2,2,2,1,2,2,,1,4,1,3,3,3,3,4,3,3,4,3,5,2,5,4,7,2,2,2,2,2,2,3,2,3,2,3,2,3,5,4,1,1,5,6,6,2,2,2,4,5,3,2,4,4,4,5,5,4,2,4,2,2,4,2,1,2,1,1,0,,,,,,0,1,1,1,1,9,2,1,8,1,1,1,,3,1,1,1,1,3,5,2,5,5,3,2,2,2,1,5,1,5,3,3,2,2,2,2,1,2,7,5,1,,,,,,,,,,9,34,2,9,,,4,1,3,2,3,2,2,1,9,9,1,1,1,1,1,1,1,1,0,1,1,1,13,,,,,,3,1,,50,0
1,28,101,3,2,4,6,772,0,1,1,2,1,29,6,2,5,3,14,0,3,4,3,1,4,4,3,3,2,2,2,2,3,,2,,,,,1,4,4,4,4,4,3,2,8,2,4,2,3,3,2,,2,2,1,2,1,2,2,2,2,2,2,2,1,7,1,3,1,4,7,4,5,6,,4,5,6,6,5,4,2,7,5,5,6,7,6,3,5,2,4,2,4,3,7,7,1,3,2,7,7,6,1,1,1,1,1,1,6,6,7,4,5,6,5,5,2,2,2,4,2,1,1,1,0,0,,,,0,,0,0,0,1,1,9,1,1,8,1,2,,10,,2,,2,,4,5,1,1,1,4,2,2,2,2,5,1,5,3,,,4,3,3,2,2,8,8,1,,,,,,,,,,12,19,1,8,,,1,,3,1,0,1,2,1,9,9,1,1,1,0,1,0,1,1,0,1,1,0,12,,,,,,3,1,,40,0
1,29,101,3,2,4,2,772,0,1,1,2,1,29,6,1,12,30,3,13,13,3,1,3,4,3,1,3,3,2,2,2,3,,2,,,,,4,4,4,4,4,4,2,3,1,2,2,2,3,4,2,2,2,1,1,2,1,2,2,2,2,2,1,2,1,1,2,4,1,3,4,4,3,2,4,3,4,2,5,4,4,2,5,1,3,2,5,3,3,4,3,4,3,4,3,4,4,2,3,3,3,4,5,3,3,3,3,5,5,3,5,5,1,3,5,1,5,1,1,2,4,2,1,2,1,1,0,0,1,0,0,0,0,0,1,3,1,8,2,1,8,1,2,,4,,2,,1,3,2,3,1,5,4,4,2,2,2,1,5,1,1,5,3,2,3,2,3,2,3,6,2,1,,,,,,,,,,11,20,4,8,,,4,2,3,2,2,1,2,1,9,9,1,1,1,1,0,0,1,0,0,1,1,0,4,1,4,1,2,,1,1,,40,0
1,30,101,3,2,4,6,772,0,1,1,2,1,29,6,1,5,3,0,0,,4,2,1,4,3,2,3,2,2,2,2,3,,2,,,,,1,2,4,4,4,4,2,1,8,2,2,2,2,3,,2,2,2,2,2,1,1,1,2,2,2,1,2,2,,2,2,1,3,3,5,4,5,5,4,5,6,6,6,3,2,,6,4,6,7,5,3,3,3,5,3,3,3,7,7,1,3,2,10,10,8,2,1,1,1,1,1,6,6,3,1,8,9,5,5,6,2,2,4,2,1,2,2,0,0,,0,,,,0,0,0,2,1,2,1,1,9,1,1,1,,3,1,1,1,1,2,4,1,3,1,3,2,2,2,2,5,1,5,3,,1,4,3,3,1,3,8,7,1,,,,,,,,,,6,49,1,9,,,1,2,2,2,2,2,2,1,9,9,1,1,1,1,1,1,1,1,0,1,1,1,4,1,4,1,2,,3,1,,30,0
1,31,101,3,2,4,6,772,0,2,1,2,1,29,6,1,13,27,3,0,3,1,1,3,4,4,2,3,1,2,2,2,3,,2,,,,,1,4,4,4,4,4,1,1,9,2,3,2,2,2,4,1,2,2,2,2,1,1,1,1,1,2,1,2,2,,1,2,1,2,3,7,6,5,6,4,5,7,5,5,3,2,7,4,4,6,7,5,3,4,2,4,1,3,2,7,7,1,3,2,10,8,8,1,1,1,1,1,1,4,1,1,1,6,7,5,5,3,2,2,4,2,1,1,1,0,0,0,0,0,0,0,0,0,0,1,1,1,1,1,8,1,1,1,,2,1,1,1,1,2,4,1,1,1,1,2,2,2,2,5,1,2,2,3,1,3,3,3,3,3,9,10,1,,,,,,,,,,9,58,1,7,,,1,1,3,5,0,2,1,1,9,9,1,1,1,1,1,1,0,0,0,1,1,0,9,1,4,1,2,,2,1,,35,0
1,32,101,3,2,4,6,772,0,2,1,2,1,29,6,2,27,0,0,0,,4,3,4,4,4,3,3,2,2,2,2,3,,2,,,,,1,4,4,4,4,4,2,2,6,2,3,2,3,3,4,,2,2,2,2,2,2,2,,2,1,1,1,2,,1,2,2,3,,6,3,4,3,3,3,4,4,4,5,5,7,3,5,6,7,6,4,,3,5,3,2,3,4,5,3,3,,1,4,5,1,1,3,,1,4,4,6,7,1,6,6,5,3,2,2,2,4,2,1,1,1,0,0,,,,0,0,0,0,0,2,1,9,2,1,9,1,1,1,,2,1,1,1,1,2,5,1,1,1,1,2,2,2,2,,1,4,3,,2,4,3,3,1,1,9,8,1,,,,,,,,,,6,45,1,8,,,1,2,3,5,8,1,2,1,9,9,1,1,1,1,0,1,1,0,0,1,1,0,13,,,,,,1,1,,30,0
1,33,101,3,2,4,6,772,0,2,1,2,1,29,6,1,13,3,11,0,3,4,4,4,4,4,2,3,2,2,2,2,3,,2,,,,,1,4,4,4,4,4,2,1,5,2,4,2,,5,2,2,2,2,2,2,1,2,2,2,2,2,2,2,1,1,2,2,1,2,1,3,4,7,1,1,3,3,3,4,1,1,,1,1,2,6,4,3,2,1,2,2,3,3,7,7,1,3,3,10,10,8,1,1,1,1,7,10,10,1,2,2,9,8,5,5,1,1,2,4,2,1,2,2,0,0,,0,,0,,0,0,0,1,1,9,9,1,8,1,2,,10,,2,,1,3,2,5,1,1,1,1,2,2,2,2,3,1,3,5,,1,4,3,3,1,3,7,9,1,,,,,,,,,,9,19,4,,,,4,,3,1,0,2,2,1,9,7,4,1,1,1,0,1,1,1,0,1,1,1,2,1,2,2,1,,3,1,,36,0
1,34,101,3,2,4,6,772,0,2,1,2,1,29,6,1,12,15,20,0,20,4,3,4,4,3,2,3,2,2,2,2,3,,2,,,,,1,4,4,4,4,4,2,1,5,2,4,2,4,4,2,2,2,2,1,2,1,2,2,2,2,2,2,2,1,1,2,1,1,1,3,3,3,3,2,2,3,3,3,3,1,1,,1,2,2,7,4,2,2,1,3,2,3,3,6,7,3,3,2,10,10,1,1,1,1,10,10,10,1,1,1,1,10,10,1,1,1,2,2,4,2,1,2,1,0,0,,0,,0,0,0,1,1,1,1,9,1,1,1,1,2,,3,,2,,1,3,2,4,1,1,1,1,2,2,2,2,5,1,5,5,,1,4,3,3,1,1,8,8,1,,,,,,,,,,10,27,1,8,,,1,2,2,1,0,1,1,1,9,9,1,1,1,1,1,1,1,1,0,1,1,1,9,1,2,1,1,,3,1,,35,0
1,35,101,3,2,4,6,772,0,2,1,2,1,29,6,1,15,3,27,0,27,1,1,3,4,4,1,4,1,1,1,1,3,,1,2,2,1,2,1,3,4,4,4,2,2,2,4,2,2,2,3,4,1,2,2,2,2,2,1,1,1,1,1,2,1,2,2,,1,1,1,4,5,4,4,5,6,6,5,7,6,6,5,1,7,4,4,5,7,5,4,4,1,3,2,2,3,7,7,1,3,3,10,10,8,1,1,1,1,1,1,1,1,1,1,7,10,7,8,1,2,2,4,2,1,,2,0,0,0,0,0,0,,0,0,0,1,1,8,1,1,9,1,1,1,,3,1,1,1,1,2,4,1,1,1,1,2,2,2,2,3,1,5,2,3,1,4,4,4,1,1,8,10,1,,,,,,,,,,4,59,1,7,,,1,2,3,1,0,1,2,1,9,9,1,1,1,0,1,0,1,0,0,1,1,0,9,1,2,3,2,,2,1,,35,0
1,36,101,3,2,4,6,772,0,2,1,2,1,29,6,2,15,13,0,0,,1,1,3,4,3,2,3,3,2,2,2,3,,2,,,,,1,4,1,4,4,4,1,2,8,1,3,2,2,3,2,2,2,2,2,2,2,2,2,2,2,2,2,2,2,,1,2,1,3,4,5,5,5,4,5,3,6,5,5,4,3,6,5,4,4,7,6,3,4,4,3,3,3,2,4,4,5,3,3,7,9,7,1,1,1,1,1,3,3,3,3,3,8,8,5,8,5,2,2,4,2,1,2,2,0,0,,,,0,0,0,0,0,1,1,9,2,1,9,1,2,,7,,1,2,1,2,3,4,1,1,1,1,2,2,2,2,5,1,5,,5,2,4,3,3,1,1,8,6,1,,,,,,,,,,9,40,1,8,,,1,2,3,2,2,2,2,1,9,9,1,1,1,0,1,1,1,1,0,1,1,1,13,,,,,,2,1,,30,0
1,37,101,4,2,4,5,1048,0,1,1,2,1,26,6,2,5,29,0,0,,4,3,4,4,4,2,3,2,2,2,2,3,,2,,,,,3,2,4,4,4,4,1,3,5,2,4,2,3,3,2,1,1,2,1,2,1,2,1,2,1,1,1,1,2,,2,4,1,4,3,7,4,4,5,3,7,7,3,6,6,5,7,7,3,5,7,7,4,3,4,5,3,4,3,6,7,6,2,4,6,7,7,7,3,3,5,5,3,3,1,1,1,7,5,7,5,3,2,1,3,2,1,2,1,0,0,,,,,0,0,0,0,1,2,8,8,1,8,1,1,1,,3,2,,2,,3,4,1,1,1,3,2,2,2,2,3,1,3,3,3,1,4,2,2,1,2,10,10,1,,,,,,,,,,6,30,1,10,,,3,2,3,3,3,1,1,1,9,9,1,1,1,0,1,1,1,0,0,1,1,0,13,,,,,,3,1,,40,0
1,38,101,4,2,4,5,1048,0,1,1,2,1,26,6,2,5,3,0,0,,3,1,3,4,4,3,3,2,2,2,2,3,,2,,,,,1,4,4,4,4,4,1,2,4,2,3,2,3,2,4,2,2,1,1,2,1,2,,2,,1,2,1,2,,1,3,2,2,2,6,3,4,3,3,3,4,3,4,3,2,7,4,3,3,7,5,4,,3,,4,2,3,3,6,3,3,,1,4,5,1,1,5,,1,3,4,6,9,1,6,6,5,4,1,2,2,4,1,1,2,1,0,0,1,,,0,,0,0,0,2,1,8,8,1,1,1,1,1,,1,2,,2,,3,5,1,2,3,1,2,2,2,2,3,1,4,3,3,2,4,3,3,2,3,10,4,1,,,,,,,,,,6,61,1,5,,,4,2,3,6,3,2,2,1,9,9,1,1,1,1,1,1,0,0,0,1,1,0,13,,,,,,2,1,,45,0
1,39,101,4,2,4,5,1048,0,1,1,2,1,26,6,1,13,29,0,0,,3,1,4,4,4,3,3,1,2,2,2,3,,2,,,,,1,3,4,4,4,4,1,2,10,2,4,2,3,3,3,1,2,1,1,1,1,1,1,,2,2,2,1,2,,2,3,1,4,4,1,3,5,7,2,7,3,5,2,2,1,7,4,3,5,7,7,1,4,1,1,1,1,2,3,4,5,2,3,8,8,8,8,2,1,5,4,7,6,6,10,10,7,5,4,9,1,2,1,4,2,1,1,1,1,0,,0,,,0,0,0,0,3,1,2,8,1,2,1,2,,14,,2,,2,,4,3,1,2,1,1,2,2,2,2,2,2,2,5,5,2,3,3,3,3,3,8,7,1,,,,,,,,,,9,42,1,6,,,4,2,3,2,0,2,2,1,9,9,1,1,1,1,0,0,0,0,0,1,0,0,9,2,,,,3,3,1,,55,0
1,40,101,4,2,4,5,1048,0,1,1,2,1,26,6,2,5,80,0,0,,1,1,4,4,4,3,3,3,2,2,2,3,,2,,,,,4,4,4,4,4,4,3,3,5,2,3,,3,4,2,1,1,1,1,2,1,2,1,2,1,1,1,1,2,,1,4,1,3,6,7,4,6,7,5,6,5,6,6,6,5,5,6,7,7,7,6,7,5,6,6,4,4,1,7,7,7,3,2,10,10,9,1,1,1,1,1,5,4,1,1,1,5,5,2,2,10,2,2,4,2,1,1,1,0,0,0,0,,,,0,0,0,2,1,8,1,2,2,2,2,,1,,2,,2,,3,2,1,1,7,1,2,2,2,2,5,2,1,3,3,1,4,2,2,1,2,5,10,1,,,,,,,,,,6,51,1,,,,4,1,2,2,3,2,2,1,9,9,1,1,1,1,1,1,1,1,0,1,1,0,13,,,,,,3,1,,41,0
1,41,101,4,2,4,5,1048,0,2,1,2,1,26,6,1,5,32,0,0,,4,1,2,4,5,2,3,2,2,2,2,3,,2,,,,,2,4,4,4,4,4,2,3,10,2,3,2,4,3,2,2,1,1,1,1,1,2,2,2,2,2,1,1,2,,1,4,1,1,7,7,5,5,6,7,7,7,7,7,7,7,7,7,7,7,7,7,1,5,1,4,1,1,3,5,6,6,3,,7,7,5,1,1,4,1,1,2,3,1,1,1,5,5,7,7,8,1,2,4,2,1,1,1,1,0,,,,,,0,0,0,2,1,8,8,1,8,1,1,1,,3,2,,1,3,2,3,1,1,1,1,2,1,2,2,2,2,5,5,5,2,4,3,3,3,3,8,9,1,,,,,,,,,,9,30,1,,,,4,2,4,3,0,1,1,1,9,9,1,1,0,0,0,0,0,0,0,0,0,0,14,,,,,,3,2,1,30,0
1,42,101,4,2,4,5,1048,0,1,1,2,1,27,6,2,5,0,0,0,,2,3,4,4,3,3,4,3,2,2,2,3,,2,,,,,2,3,4,4,4,4,1,3,8,2,2,2,2,2,,,2,2,2,2,2,2,1,2,1,1,1,2,2,,1,3,1,2,4,4,4,7,6,4,5,5,1,4,2,2,1,2,2,4,7,6,4,6,5,5,4,4,2,7,7,2,2,2,3,4,4,2,1,1,1,1,2,4,4,4,5,7,7,6,7,8,1,2,4,2,1,2,1,0,0,,,,0,0,0,0,0,1,1,2,1,1,2,1,2,,,,2,,2,,4,5,1,1,6,7,2,2,2,2,4,1,5,3,3,1,4,3,3,3,3,7,9,1,,,,,,,,,,6,49,2,5,,,4,2,3,2,4,1,2,1,9,9,1,1,1,1,1,1,1,0,0,1,1,1,13,,,,,,1,1,,37,0
1,43,101,4,2,4,5,1048,0,2,1,2,1,27,6,1,5,4,0,0,,3,1,4,4,5,3,3,2,2,2,2,3,,2,,,,,1,4,4,4,4,4,1,3,5,2,4,2,3,3,1,1,2,2,2,2,2,2,2,1,2,2,1,2,2,,1,4,1,4,5,7,7,3,1,1,2,5,2,1,4,1,1,1,3,3,7,5,1,1,1,2,1,3,3,3,5,1,4,3,3,6,2,1,1,1,1,1,3,1,1,1,1,1,2,1,1,4,3,1,4,2,1,1,1,1,0,,0,,,0,0,0,0,1,2,8,8,1,8,1,1,2,,3,2,,2,,3,5,1,1,7,1,2,2,2,2,5,1,4,3,3,2,4,1,1,1,1,5,5,1,,,,,,,,,,4,42,2,7,,,4,2,2,2,2,2,2,1,9,9,1,1,1,1,1,1,1,1,0,1,0,0,6,1,4,1,2,,2,2,1,30,0
1,44,101,4,2,4,5,1048,0,2,1,2,1,27,6,2,57,17,0,0,,3,1,4,4,4,3,3,2,2,2,2,3,,2,,,,,4,2,4,4,4,4,2,4,5,2,2,2,3,3,3,1,2,1,1,1,1,2,2,1,2,1,2,1,1,6,1,3,1,3,3,5,3,3,3,3,3,3,3,3,3,3,3,2,2,5,7,5,4,4,3,4,4,4,3,4,5,4,4,4,10,10,5,3,3,2,3,4,6,3,7,5,4,5,4,5,5,5,2,1,4,2,1,1,1,0,0,,,,0,0,0,0,0,2,1,8,1,1,8,1,1,1,,3,2,,2,,4,5,1,1,2,7,2,2,2,2,5,1,5,3,3,2,4,2,3,2,2,5,5,1,,,,,,,,,,6,34,1,,,,4,2,2,2,2,2,2,1,9,9,1,1,1,1,1,0,0,0,0,1,0,0,13,,,,,,3,1,,36,0
1,45,101,4,2,4,5,1048,0,2,1,2,1,27,6,2,1,19,0,0,,4,1,4,4,5,2,3,1,2,2,2,3,,2,,,,,2,4,4,4,4,4,1,3,8,2,,2,3,2,2,2,1,1,1,1,1,2,1,1,1,1,1,1,2,,1,2,1,1,6,5,5,7,6,5,4,5,5,5,4,4,2,5,5,7,7,4,7,5,5,4,7,2,1,5,7,7,2,2,1,6,5,1,1,1,1,1,7,5,10,1,1,8,7,7,9,1,2,2,4,2,1,2,1,0,0,,,,,,0,0,0,3,1,2,8,2,2,1,2,,14,,2,,2,,3,5,2,2,3,2,2,2,2,2,5,1,3,2,2,1,3,3,2,2,2,9,8,1,,,,,,,,,,3,22,2,5,,,4,1,3,3,4,2,2,1,9,,1,1,0,1,0,0,0,0,0,0,0,0,13,,,,,,1,2,1,41,0
1,46,101,4,2,4,5,1048,0,2,1,2,1,27,6,1,5,1,32,0,32,2,1,2,2,3,2,3,2,2,2,2,3,,2,,,,,4,4,4,4,4,4,2,2,10,2,3,2,3,3,1,1,2,2,1,2,1,2,2,2,1,2,1,1,2,,1,2,1,3,7,7,1,1,5,4,7,3,4,5,3,2,4,3,6,6,6,5,3,2,3,2,3,3,2,7,6,6,4,4,7,5,4,2,1,2,3,7,1,2,2,1,4,1,4,5,5,5,2,1,4,2,1,1,1,0,0,0,,,,,0,1,0,3,1,8,1,1,8,1,2,,10,,2,,1,2,2,2,2,4,1,1,2,2,2,2,5,1,1,3,3,2,4,3,3,2,3,10,9,1,,,,,,,,,,12,18,1,,,,4,2,2,1,0,1,1,1,9,9,1,1,1,0,1,1,1,1,0,1,1,0,12,,,,,,3,1,,40,0
1,47,101,4,2,4,5,1048,0,2,1,2,1,27,6,1,13,80,0,0,,4,2,4,4,3,2,3,2,2,2,2,3,,2,,,,,3,4,4,4,4,4,2,4,7,2,4,2,3,3,2,2,2,2,2,2,2,2,2,1,1,2,1,2,1,1,1,4,1,3,5,4,4,5,5,4,4,4,3,3,4,2,6,2,4,2,7,7,3,4,1,3,2,3,3,4,5,4,2,2,7,7,7,5,2,2,1,1,5,6,5,5,5,5,4,7,6,2,1,2,4,2,1,2,1,0,0,,0,,,,0,0,0,3,8,8,8,8,8,1,2,,3,,2,,2,,4,4,2,3,2,2,2,2,2,2,2,1,4,3,3,1,4,3,3,2,2,8,6,1,,,,,,,,,,6,27,1,,,,4,2,3,2,0,2,2,1,9,9,1,1,1,0,0,0,0,0,0,0,0,0,11,1,2,5,1,,3,2,1,43,0
1,48,101,4,2,4,5,1048,0,2,1,2,1,27,6,1,5,15,26,0,15,3,1,4,4,3,1,3,1,2,2,1,3,,2,,,,,1,4,4,4,4,4,1,3,7,2,3,2,3,3,2,2,2,2,1,2,2,2,1,2,2,2,1,2,2,,1,2,1,3,3,6,4,5,7,4,6,7,4,7,4,1,7,7,7,7,7,7,4,7,4,7,4,4,2,7,7,5,2,2,10,10,10,1,1,1,1,1,1,3,3,3,1,10,9,8,8,1,2,2,4,2,1,2,1,0,0,,,,,,0,0,0,2,2,2,2,2,8,1,2,,4,,2,,2,,4,4,2,2,1,1,2,2,2,2,4,1,4,3,3,2,4,3,3,3,3,8,7,1,,,,,,,,,,6,60,1,6,,,1,2,2,2,3,2,2,1,9,9,1,1,1,0,0,1,1,1,0,1,1,0,14,,,,,,2,1,,37,0
1,49,101,5,2,4,5,1092,0,1,1,2,1,27,6,2,5,,0,0,,3,1,,4,,1,5,1,2,2,2,3,,2,,,,,4,4,3,4,4,4,2,3,,2,2,2,3,3,2,2,2,2,2,2,1,,2,,1,2,2,1,1,6,1,3,1,4,2,5,6,6,4,3,6,4,5,5,7,1,4,7,6,1,7,7,7,7,7,7,7,7,2,3,6,7,2,2,9,9,2,2,2,2,2,1,3,2,1,2,3,1,8,3,6,1,2,2,4,1,1,,1,0,0,,0,,,,0,0,0,1,1,8,8,1,8,1,1,,,3,1,,1,,4,5,1,1,1,1,1,2,2,2,5,1,,5,2,2,4,3,2,2,2,9,7,1,,,,,,,,,,8,51,,,,,4,2,2,1,0,3,3,1,9,9,1,1,1,1,1,1,1,1,0,1,1,1,3,1,2,5,1,,3,1,,39,0
1,50,101,5,2,4,5,1092,0,1,1,2,1,27,6,2,21,,0,0,,1,2,1,4,4,2,5,2,2,2,2,3,,2,,,,,1,3,4,4,4,4,3,3,5,2,3,2,3,3,2,2,2,1,1,2,1,2,2,2,1,1,1,1,2,,1,,1,4,5,6,4,7,6,3,3,6,6,5,5,4,1,1,4,4,7,5,1,1,1,1,2,1,5,4,7,1,3,3,7,7,9,9,1,1,1,1,2,2,2,2,2,9,9,8,9,9,2,2,4,2,1,1,1,0,0,,0,,,0,0,0,0,,2,2,2,2,8,1,1,,,3,2,,2,,4,1,1,1,1,3,2,1,2,2,5,1,5,3,,2,4,2,2,2,2,10,,1,,,,,,,,,,3,40,2,,,,4,2,2,3,4,2,2,1,9,1,1,1,1,1,0,0,0,1,1,1,1,0,2,1,2,1,1,,2,2,1,42,0
1,51,101,5,2,4,5,1092,0,1,1,2,1,27,6,2,1,,0,0,,3,1,3,4,4,2,3,2,2,2,2,3,,2,,,,,1,2,4,4,4,4,2,3,5,2,2,2,3,3,2,2,2,2,1,2,1,2,2,2,1,2,2,2,2,,1,3,1,1,5,7,7,7,5,7,7,3,4,4,3,5,3,4,3,3,7,4,3,4,4,3,4,4,3,5,6,5,2,2,3,4,4,3,4,3,7,1,4,3,4,3,4,3,4,3,4,4,3,1,4,2,1,2,1,0,0,0,,,,0,0,0,0,3,1,2,2,1,8,1,2,,4,,2,,2,,3,4,1,1,1,1,2,2,2,2,2,2,3,3,3,2,4,3,3,1,1,10,10,1,,,,,,,,,,2,45,2,,,,4,2,3,3,5,1,1,1,9,1,1,1,1,0,1,0,1,1,0,1,1,0,13,,,,,,3,2,3,40,0
1,52,101,5,2,4,5,1092,0,1,1,2,1,27,6,2,5,24,0,0,,4,1,4,4,2,2,2,2,2,2,2,3,,1,1,2,2,2,2,2,4,4,4,4,1,2,8,2,3,2,5,3,2,1,2,2,1,2,2,2,2,2,1,2,1,2,2,,1,3,1,3,5,7,3,4,5,4,7,4,3,4,1,1,2,2,3,4,7,7,3,3,3,1,3,3,2,5,6,4,3,3,9,3,2,5,1,1,1,1,1,2,1,1,1,3,4,3,2,1,2,1,4,2,1,1,1,0,0,0,0,,,0,0,0,0,3,1,8,1,1,1,1,1,1,,2,1,1,1,1,1,2,1,1,1,2,2,2,2,2,3,1,5,3,3,2,4,2,2,2,2,10,9,1,,,,,,,,,,18,42,1,9,,,1,2,3,2,3,1,1,1,9,9,1,1,1,1,1,1,1,1,0,1,1,1,1,1,2,1,2,,3,1,,41,0