PAIS,IDNUM,ESTRATOPRI,JAMPARISH,JAMCONSTIT,JAMAREA,UPM,CLUSTER,JAMCLUSTER,SEC,UR,TAMANO,JAMDIOMA,DIA,MES,Q1,A4,DEM13A,DEM13B,DEM13C,DEM13D,A1,A2,A3,A4I,SOCT1,SOCT2,IDO1,IDIO2,CP2,CP4A,CP4,PROT1,PROT2,CP5,CP5A,CP5B,CP5C,CP5D,CP6,CP7,CP8,CP9,CP10,CP13,LS3,IT1,L1,NP1,NP1B,NP2,SGL1,SGL2,LGL2,LGL3,MUNI2,MUNI3,MUNI5,MUNI6,MUNI8,MUNI9,MUNI10,MUNI11,MUNI15,JC1,JC4,JC10,JC12,JC13,JC15,JC16,POP1,POP2,POP3,POP4,POP5,VIC1,VIC2,AOJ1,AOJ1B,AOJ8,AOJ11,AOJ11A,AOJ12,AOJ16A,AOJ17,AOJ18,ST1,ST2,ST3,ST4,B1,B2,B3,B4,B6,B10A,B11,B12,B13,B14,B15,B18,B20,B21,B31,B32,B43,B16,B19,B37,B42,B47,N1,N3,N9,N10,N11,N12,M1,ING4,PN2,DEM23,PN4,PN5,E5,E8,E11,E15,E14,E2,E3,E16,D32,D33,D34,D36,D37,D1,D2,D3,D4,D5,DEM2,DEM11,AUT1,PP1,PP2,DC1,DC10,DC13,EXC2,EXC6,EXC11,EXC13,EXC14,EXC15,EXC16,EXC17,EXC18,EXC19,EXC7,GI1,GI2,GI3,GI4,GI5,VB1,VB2,JAMVB3,VB4,VB8,VB6,JAMVB7,VB10,JAMVB11,POL1,POL2,AA1,AA2,AA3,AA4,DIS2,DIS3,DIS4,DIS5,ED,Q2,Q3,Q10,Q10A,Q10B,Q10C,Q14,Q10D,Q11,Q12,JAMETID,JAMETIDA,JAMLENG1,R1,R3,R4,R4A,R5,R6,R7,R8,R12,R14,R15,OCUP1,OCUP4,OCUP1A,OCUP1B1,OCUP1C,DESOC2,MIG1,MIG2,MIG3,TI
23,1,2303,12,3,2,72,2.303e+10,3,888,2,5,1,29,6,2,5,6,0,,99,1,1,2,4,4,2,2,2,2,2,2,,,2,,,,,1,4,4,3,4,4,2,1,,2,3,2,5,1,2,2,2,4,0,0,0,9,9,4,1,2,2,2,2,2,2,2,2,2,2,1,1,1,1,2,1,2,2,1,3,2,4,1,9,9,9,9,3,3,4,2,2,5,6,,1,1,,1,5,2,2,2,6,,,4,,,4,5,6,6,3,6,3,4,7,,2,2,7,10,5,6,1,1,1,1,3,1,10,10,1,5,5,5,5,1,1,2,2,4,2,1,2,2,0,,9,9,9,0,9,0,1,1,1,1,1,2,1,,1,1,1,99,3,1,1,1,1,3,4,3,1,1,7,2,2,2,2,5,81,2,,,1,4,2,1,2,1,4,4,2,1,1,0,1,0,0,0,0,1,1,0,14,,,,,,1,1,,
23,2,2303,12,3,2,72,2.303e+10,3,888,2,5,1,29,6,1,5,0,,,99,2,2,4,4,5,3,4,3,1,1,2,3,,2,,,,,2,4,4,3,4,4,3,1,,2,4,1,5,5,1,2,1,4,0,0,0,9,9,4,1,2,1,1,,,2,2,2,2,2,1,1,2,99,9,9,1,1,1,2,2,4,,9,9,9,3,2,2,3,1,,2,2,,1,1,,2,5,2,,1,7,,,5,,1,1,1,1,1,1,1,5,5,7,,,,6,10,8,1,1,1,1,1,1,1,10,10,1,10,10,10,10,1,3,2,1,4,2,1,1,1,0,0,0,9,9,0,0,0,0,0,1,,1,,,,1,1,2,99,2,1,2,1,2,2,4,1,1,1,7,2,2,2,2,5,80,2,,,9,1,2,,6,1,4,4,2,0,0,0,0,0,0,0,0,0,0,0,5,2,,,,,1,1,,
23,3,2303,11,3,2,59,2.303e+10,2,888,2,5,1,4,7,1,3,,,,99,4,2,2,2,3,3,5,3,2,2,2,3,,2,,,,,2,3,4,4,4,4,4,4,4,2,3,2,4,,2,2,6,4,0,,0,9,9,4,0,,,1,1,1,2,,2,2,,1,2,2,99,9,9,1,2,1,3,2,4,,3,2,9,9,5,,3,4,2,3,,5,4,5,,5,6,4,,1,7,,,4,6,,4,,3,3,3,2,3,6,,2,,2,9,9,10,2,5,8,2,2,1,1,1,8,1,9,10,8,8,1,2,2,2,2,2,1,2,3,1,0,9,9,9,0,0,0,1,0,1,1,1,,1,2,2,2,99,7,9,2,99,1,1,3,4,1,6,2,6,2,2,2,2,4,50,4,5,,9,4,,4,2,3,3,5,3,1,1,0,1,2,0,0,0,1,1,0,9,1,3,1,2,,1,1,,120
23,4,2303,11,3,2,59,2.303e+10,2,888,2,5,1,4,7,2,4,,,,99,1,3,4,4,4,3,4,3,1,1,2,3,,2,,,,,1,3,3,3,4,3,3,2,5,2,3,1,5,5,1,,6,,0,,1,4,0,4,2,2,2,2,2,2,2,2,2,2,,2,2,2,99,9,9,1,1,1,2,2,4,1,1,1,9,4,2,,1,1,,7,1,7,,,,2,3,2,,3,7,,,7,,2,2,,1,7,4,1,,7,6,1,3,,1,10,,1,1,1,10,1,1,1,8,7,1,10,10,8,,1,2,2,2,4,1,1,2,3,0,0,0,9,0,0,0,,0,0,1,1,1,,1,,1,1,2,99,2,1,2,2,99,4,5,2,2,1,7,2,2,2,2,10,39,2,1,,9,4,2,4,1,4,4,4,3,0,0,0,0,0,0,0,0,0,0,0,13,,,,,,1,1,,125
23,5,2303,11,3,2,59,2.303e+10,2,888,2,5,1,4,7,2,70,,,,99,2,3,4,4,4,3,5,3,1,2,2,3,,2,,,,,1,3,3,4,4,4,2,2,5,2,3,2,3,,1,1,6,4,0,2,0,9,9,4,2,2,2,2,2,2,2,2,2,2,2,2,2,2,99,9,9,1,1,1,2,2,4,1,2,9,9,9,2,,6,5,6,3,6,6,5,5,,6,7,5,4,5,6,,,5,6,5,4,5,3,4,5,2,2,6,5,5,2,1,10,10,7,1,1,,1,2,1,1,1,6,1,9,9,9,9,,2,2,2,4,2,1,1,2,0,0,9,9,9,9,0,0,,0,,2,1,1,,1,,1,,99,1,1,,2,99,3,4,1,5,3,6,2,2,2,2,5,73,2,1,,9,4,2,4,2,4,4,4,3,0,0,0,0,0,0,0,0,0,0,0,6,2,,,,,1,1,,90
23,6,2303,11,3,2,59,2.303e+10,2,888,2,5,1,5,7,2,5,,,,99,4,1,3,4,5,1,4,2,2,2,1,3,,2,,,,,1,4,4,4,4,4,2,1,5,2,3,2,,,2,2,6,3,0,,0,9,9,4,,2,2,2,2,2,2,2,,2,2,2,2,2,99,9,9,1,2,2,2,2,4,1,2,9,9,9,4,6,7,3,7,5,7,7,7,7,,7,7,7,5,4,7,7,5,7,6,7,7,5,4,6,7,5,3,7,7,7,2,1,10,10,8,1,1,5,1,2,1,1,1,4,1,10,10,9,10,5,2,2,2,4,2,2,2,3,0,0,9,9,9,0,9,0,0,0,2,1,1,,1,,1,1,2,99,2,,99,1,2,4,5,1,6,5,6,2,2,2,2,6,65,2,3,,9,4,2,4,6,5,4,4,3,1,1,0,1,1,0,0,0,1,1,0,14,,,,,,1,1,,80
23,7,2303,11,3,2,59,2.303e+10,2,888,2,5,1,3,7,2,5,,,,99,3,3,3,4,3,2,3,2,2,2,2,3,,2,,,,,1,4,4,4,4,4,2,2,,2,3,2,2,,1,,2,4,0,1,0,9,9,4,2,2,1,1,2,2,,2,2,,,1,2,2,99,9,9,1,3,1,2,2,4,,9,9,9,9,5,1,2,3,2,3,4,6,4,3,4,3,7,1,4,4,7,,3,1,4,1,5,6,4,6,5,5,3,6,7,4,2,2,9,8,10,1,1,,2,1,1,1,1,1,7,4,8,6,8,1,2,2,1,4,2,1,2,2,0,0,9,9,9,0,9,0,1,1,1,1,1,,2,,1,2,99,3,9,2,99,2,99,4,4,1,1,1,4,2,2,2,2,13,22,2,4,,9,4,2,1,2,1,4,4,3,1,1,0,1,1,0,1,0,0,1,0,13,,,,,,1,1,,60
23,8,2303,12,3,2,72,2.303e+10,3,888,2,5,1,28,6,2,3,3,10,13,13,1,1,2,3,2,2,3,2,2,2,2,3,,2,,,,,1,4,4,4,4,4,3,2,,2,2,2,3,,1,2,2,3,0,1,0,9,9,4,1,2,2,2,2,2,2,2,2,2,2,2,2,2,99,9,9,2,3,1,3,2,4,1,9,9,9,9,,4,5,4,4,2,5,,1,1,,1,6,2,3,4,7,5,,5,4,4,5,,,,5,1,4,1,7,,2,2,9,10,10,10,1,1,8,8,1,1,10,10,1,1,1,1,1,1,2,2,2,4,2,2,2,2,0,0,0,9,9,9,9,0,0,0,2,1,1,,,,1,2,99,10,9,2,99,2,99,3,5,1,1,1,2,2,2,2,2,14,19,2,,,9,1,2,4,1,0,4,4,3,1,1,0,1,0,0,0,0,0,0,0,12,,,,,,1,1,,
23,9,2303,12,3,2,72,2.303e+10,3,888,2,5,1,28,6,1,3,6,13,0,6,1,1,3,4,4,2,4,2,2,2,2,2,,2,,,,,4,4,4,4,4,4,2,2,6,2,2,2,3,,1,2,1,4,0,1,0,9,9,4,1,2,1,2,2,2,,,1,2,2,2,2,2,99,9,9,1,2,2,3,2,4,1,2,9,9,9,4,4,3,4,2,3,4,1,1,1,,4,5,5,,,7,,,4,,,2,2,2,4,4,1,4,1,6,,3,2,3,10,3,2,5,2,2,5,3,3,10,,3,10,10,10,10,1,,2,1,4,2,1,2,2,0,0,9,9,9,0,9,0,0,0,2,1,1,,1,,1,2,99,14,9,2,99,1,2,2,5,1,4,2,7,2,2,2,2,4,65,2,,,9,1,2,4,5,5,4,4,2,1,1,0,1,0,0,0,0,0,1,0,10,2,,,,52,1,1,,57
23,10,2303,12,3,2,72,2.303e+10,3,888,2,5,1,28,6,2,5,0,,,99,2,3,3,4,2,2,4,2,2,2,2,,,2,,,,,4,4,4,4,4,4,2,2,6,2,2,2,2,3,1,1,1,4,0,0,0,9,9,4,2,2,2,2,2,2,1,2,1,1,2,2,2,1,4,1,,2,1,2,3,2,4,,9,9,9,9,3,4,5,5,5,6,7,3,4,4,,4,6,4,,4,7,,,4,2,5,1,2,3,1,4,7,2,,,,2,2,4,8,,4,1,1,,4,1,1,9,9,1,9,9,9,9,7,1,2,2,3,2,1,3,1,0,0,9,9,0,0,9,0,1,1,2,2,1,2,2,,2,2,99,10,9,2,99,1,2,3,5,1,7,4,7,2,2,2,2,10,31,2,2,3,1,1,1,4,1,1,4,4,2,1,1,0,1,0,0,0,0,0,0,0,12,,,,,,1,1,,
23,11,2303,4,2,2,65,2.303e+10,1,888,2,5,1,2,8,2,,,,,99,1,1,1,4,2,2,2,1,2,2,2,3,,2,,,,,2,2,4,4,4,4,2,3,,2,3,2,4,4,1,,5,3,0,2,0,9,9,2,2,2,1,1,2,1,,,2,1,2,1,1,2,99,9,9,1,2,1,2,2,4,2,2,,2,9,5,1,2,1,2,4,5,7,3,5,4,6,7,1,4,5,7,4,5,7,7,1,1,3,3,4,2,1,3,7,7,1,2,2,10,10,1,7,1,1,1,5,1,6,1,1,1,10,10,10,10,1,2,2,2,4,2,1,2,1,0,0,9,9,9,0,9,0,1,0,1,1,1,,1,,1,1,1,99,,2,99,2,99,4,4,1,1,1,3,2,2,2,2,11,27,1,6,3,2,4,1,2,1,1,4,4,2,1,1,0,1,1,0,0,,0,0,0,,2,,,,,1,1,,
23,12,2303,4,2,2,65,2.303e+10,1,888,2,5,1,2,8,2,,15,3,6,3,3,1,2,3,2,2,4,3,2,2,2,3,,2,,,,,3,4,4,4,4,4,2,2,9,2,,2,,,1,1,10,4,0,1,0,9,9,4,0,2,2,2,2,2,2,2,2,2,2,1,2,2,99,9,9,1,2,1,2,2,4,1,9,9,9,9,5,4,5,4,3,3,3,4,1,1,2,2,4,1,5,4,6,4,4,6,5,5,5,5,3,5,3,4,2,6,7,2,2,2,5,9,9,1,1,1,1,2,8,3,3,6,3,9,9,10,10,10,2,2,2,4,2,1,2,3,0,0,9,0,9,9,9,0,1,1,1,1,1,1,1,2,1,2,99,3,9,2,99,2,99,4,5,1,1,1,6,2,2,2,2,16,31,3,6,,9,4,1,1,1,0,4,4,3,1,1,1,1,1,1,1,0,1,1,1,1,1,1,4,1,,1,1,,
23,13,2303,4,2,2,65,2.303e+10,1,888,2,5,1,2,8,2,,,,,99,1,1,3,4,3,1,3,2,1,1,2,3,,1,2,1,1,1,1,2,3,4,4,3,4,2,,2,,2,2,,,1,6,,0,1,0,9,9,3,2,2,2,2,2,2,2,2,2,2,2,2,2,2,99,9,9,1,2,1,3,1,4,1,3,3,1,9,1,7,7,6,7,1,4,4,4,5,3,1,2,1,1,2,7,,5,5,7,3,6,6,6,7,7,5,2,7,7,7,2,2,9,10,10,1,1,1,1,1,10,10,1,10,1,10,10,10,10,10,2,2,2,4,2,1,2,2,0,0,9,9,9,0,9,0,0,0,2,,1,,1,,1,1,1,99,1,1,1,2,99,2,4,1,1,1,7,1,,1,2,9,61,2,0,,9,2,2,4,1,0,4,4,3,1,1,0,0,0,0,0,0,1,1,0,7,2,,,,,1,1,,
23,14,2303,4,2,2,65,2.303e+10,1,888,2,5,1,2,8,2,,,,,99,1,1,3,4,4,3,4,3,2,1,2,3,,1,2,1,1,2,1,2,2,2,4,4,2,2,5,2,,1,4,4,1,1,6,3,0,2,0,9,9,3,2,2,2,2,2,2,2,1,2,2,,1,2,2,99,9,9,1,2,1,3,2,,1,2,2,9,2,4,5,3,3,4,3,3,5,4,4,5,3,6,3,5,4,6,5,5,4,4,3,3,,4,4,4,3,3,5,5,4,2,2,7,10,8,3,1,5,1,1,4,3,1,8,5,10,8,5,4,1,2,2,2,4,2,1,2,2,0,0,9,0,9,0,0,0,1,1,1,,1,,,,1,2,99,3,9,2,99,2,99,2,4,1,1,1,1,2,2,2,2,13,38,2,4,,1,3,2,4,1,6,4,5,3,1,1,0,1,0,0,0,0,1,1,1,1,1,1,1,2,,1,1,,
23,15,2303,4,2,2,65,2.303e+10,1,888,2,5,1,2,8,2,,1,0,,99,1,2,3,4,5,3,2,1,2,2,2,3,,1,1,,1,2,1,3,3,4,3,4,1,2,7,2,2,2,3,3,1,2,6,,0,2,0,9,9,4,2,2,2,2,2,2,2,2,2,1,2,2,,2,99,9,9,1,2,1,3,2,2,2,4,9,9,2,3,5,1,1,7,1,5,6,1,5,1,1,5,1,4,6,5,1,4,4,6,7,1,1,1,1,3,1,1,1,5,5,3,2,10,10,10,5,1,1,1,5,1,5,1,5,1,10,5,7,8,1,2,2,2,4,2,1,2,1,0,0,9,0,9,0,0,0,1,1,1,1,1,1,1,,1,1,2,99,3,1,2,2,99,2,4,1,1,3,1,2,2,2,2,6,40,2,3,,9,3,,2,2,4,4,4,2,1,1,1,1,1,1,0,0,1,1,0,9,1,4,1,2,,1,1,,
23,16,2303,4,2,2,65,2.303e+10,1,888,2,5,1,2,8,1,,,,,99,1,1,3,4,3,2,2,2,2,1,2,3,,2,,,,,2,2,3,3,4,4,2,3,10,2,3,2,4,4,1,2,6,4,0,0,0,9,9,2,2,2,2,2,2,1,,2,2,2,2,1,2,2,99,9,9,1,3,1,2,2,4,2,3,3,2,2,3,7,4,4,7,4,6,7,4,6,5,4,3,4,6,4,7,4,1,3,1,6,4,5,2,2,4,1,3,7,7,1,2,1,10,10,10,1,1,1,1,5,10,1,1,1,1,10,10,5,10,1,2,2,2,4,2,1,2,2,0,0,9,0,9,9,0,,1,1,1,1,1,,1,,1,2,99,7,9,2,99,1,1,2,4,1,1,1,1,2,2,2,2,11,28,2,6,,9,3,,1,1,2,4,4,3,1,1,0,1,0,0,1,,0,0,0,7,1,4,1,2,,1,2,,
23,17,2303,4,2,2,65,2.303e+10,1,888,2,5,1,2,8,1,3,1,2,,2,1,1,2,4,5,2,4,2,2,2,2,3,,1,1,1,1,2,1,2,4,4,3,4,4,1,9,2,,,4,,1,2,2,3,0,1,0,9,9,2,1,2,2,2,2,2,,,2,2,2,2,2,2,99,9,9,1,1,4,2,2,4,1,2,9,9,9,1,6,4,4,5,3,4,6,3,3,7,5,7,6,3,6,7,1,,6,7,2,1,4,1,2,4,1,4,5,6,3,3,4,9,10,8,10,1,1,1,5,1,1,3,2,1,10,10,8,10,1,2,2,2,4,2,1,3,3,0,0,9,0,9,9,9,0,1,1,1,1,1,2,2,,2,1,,99,3,1,,1,77,1,1,1,4,1,6,2,1,2,2,6,55,5,1,,9,4,2,3,2,2,4,4,3,1,0,0,0,0,0,0,0,1,1,0,10,1,2,4,2,,1,1,,
23,18,2303,4,2,2,65,2.303e+10,1,888,2,5,1,2,8,1,5,3,4,,4,1,1,2,4,5,1,2,1,2,2,2,3,,1,1,2,1,1,3,4,4,4,4,3,1,,10,2,,2,3,,1,2,10,4,1,,1,2,1,4,,2,2,1,2,2,1,1,2,2,2,,2,2,99,9,9,1,1,1,2,2,4,1,1,9,9,9,1,7,6,1,4,3,7,2,1,7,7,2,7,7,2,,7,5,6,7,7,4,1,5,1,1,1,1,3,7,6,6,3,2,1,1,9,1,1,1,1,1,3,8,1,10,3,10,10,9,9,1,2,2,2,4,2,1,2,2,0,0,9,9,9,1,0,0,1,1,2,,1,,1,,1,1,1,99,3,1,1,1,1,3,5,7,7,5,1,2,1,2,2,,66,4,3,,1,1,2,1,2,4,,,3,1,1,1,1,1,0,1,0,1,1,0,14,,,,,,2,1,,
23,19,2303,4,2,2,65,2.303e+10,1,888,2,2,1,2,8,1,3,,,,99,1,3,4,4,3,1,3,1,2,2,2,3,,2,,,,,1,4,4,4,4,4,3,3,9,2,,2,,,1,1,2,,0,,0,9,9,,,2,1,1,2,1,2,2,2,2,2,2,2,2,99,9,9,2,4,1,1,1,4,1,9,9,,4,6,7,7,7,7,7,7,7,7,7,,5,7,5,5,5,7,7,,7,6,6,4,7,3,7,3,3,3,7,7,1,1,2,1,10,7,1,1,1,6,1,10,1,1,10,1,10,1,10,10,1,2,2,2,3,2,1,2,2,0,0,9,0,9,0,0,1,0,0,2,1,1,2,1,,1,1,1,99,3,2,99,1,1,2,4,1,2,1,7,2,2,,2,8,31,2,5,,9,3,2,4,2,4,4,4,2,1,1,0,1,0,0,0,0,0,0,0,10,1,4,1,2,,1,2,2,
23,20,2303,4,2,2,65,2.303e+10,1,888,2,5,1,2,8,2,5,6,,,99,1,1,2,3,2,2,2,2,2,2,2,3,,2,,,,,3,2,4,3,4,4,1,2,4,2,,2,,,2,2,2,4,0,0,0,9,9,4,0,2,2,,2,2,1,1,2,2,,1,2,2,99,9,9,1,2,1,4,,4,1,9,9,9,9,5,2,3,1,3,2,5,6,1,4,4,4,5,1,3,3,7,4,4,4,1,5,7,,5,,5,6,1,,6,6,2,2,1,10,4,1,1,1,1,1,10,5,10,1,1,8,1,5,5,7,2,2,1,4,2,1,2,3,0,0,9,0,9,9,0,0,1,1,1,1,1,1,1,,1,1,77,99,1,,99,2,99,2,4,1,3,1,1,2,2,2,2,14,48,2,6,,9,4,2,2,2,3,4,4,3,1,1,1,1,0,1,0,0,1,1,1,1,1,1,3,,,1,1,,
23,21,2303,4,2,2,30,2.303e+10,1,888,2,5,1,2,8,1,19,13,,,99,1,1,3,4,4,3,4,3,2,2,2,,,2,,,,,1,4,4,4,4,4,2,2,,2,,2,5,4,4,,1,3,0,0,0,9,9,4,,2,2,2,2,2,2,2,2,2,2,2,2,2,99,9,9,1,2,1,2,2,4,1,9,9,9,9,5,5,5,5,5,6,5,6,6,6,,4,7,6,7,5,7,,,7,7,6,4,5,5,5,5,3,3,7,7,1,2,2,10,10,10,1,1,1,1,1,1,1,1,1,1,10,10,10,10,10,2,2,2,4,2,1,1,1,0,0,9,9,9,9,0,0,0,0,2,1,1,1,1,9,1,1,77,99,2,1,77,2,99,4,5,1,1,1,5,2,2,2,2,10,46,2,3,1,2,1,,2,2,5,4,4,3,1,1,1,1,0,0,0,0,1,1,0,2,1,1,3,1,,1,,,
23,22,2303,4,2,2,30,2.303e+10,1,888,2,5,1,2,8,1,13,,,,99,1,1,3,4,2,1,2,1,1,1,1,,,1,1,1,2,2,1,2,4,4,4,4,1,1,,2,,1,2,2,1,1,6,4,0,1,0,9,9,4,1,2,2,2,2,2,2,2,2,2,2,2,2,2,99,9,9,1,2,1,3,2,4,1,9,9,9,9,7,7,7,7,7,7,7,7,7,7,7,7,7,7,7,7,7,7,7,7,7,7,6,6,2,7,6,2,,7,7,1,2,1,10,10,10,1,1,1,1,1,1,1,1,1,1,10,10,10,10,10,2,2,2,3,2,1,2,3,0,0,0,0,9,9,0,0,0,0,2,1,1,1,1,,1,1,,99,2,1,1,1,1,4,4,1,1,1,1,2,2,2,2,10,32,2,,,9,4,,2,1,4,4,4,3,0,0,0,0,0,0,0,0,0,0,0,,,,,,,,,,
23,23,2303,4,2,2,30,2.303e+10,1,888,2,5,1,2,8,1,5,6,,,99,1,3,3,4,4,3,4,3,2,2,2,3,,2,,,,,3,3,4,4,4,4,2,2,,2,,2,3,3,4,,1,3,0,1,0,9,9,4,,2,2,2,2,2,2,2,2,2,2,2,2,2,99,9,9,1,2,2,2,2,4,1,9,9,9,9,4,4,2,2,2,3,3,5,4,2,,4,5,4,3,5,5,3,5,2,7,3,1,1,1,1,1,1,1,7,4,1,3,2,10,10,10,1,1,1,1,1,1,1,1,1,1,10,10,10,10,10,2,2,2,4,2,1,1,3,0,0,9,9,9,0,9,0,0,1,1,1,1,1,1,,1,1,2,99,3,1,2,1,2,4,4,1,1,1,2,2,2,2,2,3,43,2,3,,9,1,2,3,1,4,4,4,3,1,0,1,0,0,0,0,0,0,0,0,5,1,4,,2,,1,,,
23,24,2303,4,2,2,30,2.303e+10,1,888,2,5,1,2,8,1,3,13,,,99,3,3,3,4,2,1,2,2,2,2,2,,,2,,,,,3,4,4,4,4,4,2,1,,2,,2,3,3,4,2,2,2,0,1,,9,9,4,1,2,2,2,2,2,2,2,2,2,2,2,2,2,99,9,9,1,2,1,2,2,4,1,9,9,9,9,7,7,7,7,7,7,7,6,5,4,7,7,7,7,7,7,7,7,7,7,7,7,2,6,3,6,3,1,4,7,7,1,2,2,10,10,10,1,1,1,1,1,1,1,1,1,1,10,10,10,10,10,2,2,2,4,2,1,1,1,0,0,9,9,9,9,0,0,0,0,2,1,1,1,1,9,1,1,1,99,1,,99,,99,4,4,1,1,1,5,2,2,2,2,2,27,2,3,,,1,,3,3,2,4,4,3,0,0,0,1,0,0,0,0,0,0,0,11,2,,,,,1,1,,
23,25,2303,4,2,2,30,2.303e+10,1,888,2,5,1,2,8,2,5,13,0,,99,1,1,3,4,4,3,4,2,2,2,2,3,,2,,,,,1,4,4,4,4,4,2,1,,2,,2,4,,,2,1,3,0,,0,9,9,4,,2,2,2,2,2,2,2,2,2,2,2,2,2,99,9,9,1,3,2,,2,4,,9,9,9,9,7,6,3,5,5,6,4,7,7,7,,6,7,5,7,,7,,,,7,6,1,5,1,4,2,2,4,7,7,1,2,1,1,10,10,1,1,1,1,1,1,1,1,3,1,10,10,10,9,9,2,2,2,4,2,1,1,3,0,0,9,9,9,9,9,0,1,1,1,1,,1,1,1,,,99,99,9,1,1,1,1,4,5,1,1,1,6,2,9,,,4,,2,1,,9,4,2,4,6,0,4,4,3,1,1,0,0,0,0,0,0,0,1,0,,2,,,,,2,1,,
23,26,2303,4,2,2,30,2.303e+10,1,888,2,5,1,2,8,2,5,13,,,99,1,2,3,4,4,3,4,3,2,2,2,,,2,,,,,2,2,4,4,4,4,2,1,,2,,2,2,3,1,,2,2,0,1,0,9,9,,,2,2,2,2,2,2,2,2,2,2,2,2,2,99,9,9,1,2,2,2,2,4,1,1,1,,9,,7,7,7,7,7,7,7,7,7,,7,7,7,7,7,7,,,7,7,7,2,5,2,4,2,1,4,7,7,1,2,1,10,10,10,1,1,1,1,1,1,1,1,7,1,10,10,10,10,10,2,2,2,4,2,1,1,1,0,0,9,9,9,9,0,0,0,0,2,1,1,1,1,9,1,1,,99,2,1,1,1,1,3,4,1,1,1,4,2,2,2,2,9,28,2,3,,9,4,2,1,2,14,4,3,1,0,0,1,0,0,0,0,0,0,0,0,10,2,,,,,1,1,,
23,27,2303,4,2,2,30,2.303e+10,1,888,2,5,1,2,8,2,3,13,,,99,1,3,3,4,4,2,4,3,2,2,1,3,,2,,,,,1,2,4,4,4,4,3,2,,2,,2,,,,2,6,3,0,,0,9,9,4,1,2,2,2,2,2,2,2,2,2,2,2,2,2,99,9,9,1,3,1,2,2,4,1,1,1,1,1,,7,5,6,7,6,5,7,6,6,6,6,7,5,7,6,7,6,7,6,7,6,3,6,2,4,3,2,3,7,7,1,1,1,10,10,10,1,1,1,1,1,1,1,1,6,1,10,10,10,10,10,2,2,2,4,2,1,1,2,0,0,9,9,9,9,9,0,0,0,2,1,1,1,1,,1,1,2,99,3,1,2,1,2,2,4,1,1,1,4,2,2,2,2,11,37,5,0,,9,4,2,,1,3,4,4,3,0,0,0,0,0,0,0,0,0,0,0,11,2,,,,,1,,,
23,28,2303,4,2,2,30,2.303e+10,1,888,2,5,1,2,8,2,3,3,25,10,3,1,1,2,4,3,2,3,2,1,2,2,3,,2,,,,,1,2,4,4,4,4,2,2,7,2,2,2,3,,4,2,2,3,0,1,0,9,9,4,2,2,2,1,2,2,1,1,2,2,2,1,2,2,99,9,9,1,3,1,3,2,4,1,2,2,9,9,1,6,3,4,5,2,4,5,4,3,4,4,6,4,5,3,7,5,5,5,4,4,3,5,5,4,4,3,3,5,6,2,2,2,5,10,3,2,1,1,1,1,8,2,1,1,1,7,4,5,4,7,2,2,2,4,2,1,2,1,0,0,9,1,0,9,9,0,1,1,1,1,1,1,1,,1,1,1,99,3,1,1,2,99,3,4,1,1,3,5,2,2,2,2,16,50,2,4,,9,4,2,3,2,,4,4,3,1,1,1,1,1,0,0,0,1,1,0,1,1,1,4,1,,1,2,,
23,29,2303,4,2,2,30,2.303e+10,1,888,2,5,1,2,8,1,4,3,7,13,7,1,2,3,4,4,3,3,3,2,2,2,,,2,,,,,1,,,,,,3,2,,2,2,2,2,,1,2,2,3,0,3,0,9,9,3,2,2,2,2,2,2,2,2,2,2,2,2,2,2,99,9,9,1,3,1,,2,3,1,2,3,2,2,6,6,4,5,5,4,6,7,5,6,6,5,7,5,6,5,7,7,7,7,5,5,2,4,5,6,6,2,2,7,7,,1,1,,10,10,1,1,1,1,1,1,1,1,1,1,10,10,1,1,,2,2,2,1,2,,2,3,0,0,9,0,0,9,0,0,0,0,,1,1,1,1,,1,1,,99,2,1,,1,,1,4,1,1,1,7,1,2,2,1,14,50,2,5,,9,4,2,2,1,3,4,4,3,0,0,0,1,0,1,0,0,1,1,0,1,1,1,4,1,,1,2,,
23,30,2303,4,2,2,30,2.303e+10,1,888,1,2,1,2,8,2,19,26,,,99,2,3,4,4,5,3,4,3,2,2,2,3,,2,,,,,1,4,4,4,4,4,1,1,,2,,2,,,,2,1,3,0,,0,9,9,4,,2,2,2,2,2,2,2,2,2,2,2,2,2,99,9,9,1,2,1,2,2,4,1,,,,,,6,6,6,6,7,5,7,7,6,5,4,7,5,7,3,7,3,7,5,6,4,1,5,1,4,2,2,4,7,7,1,2,2,10,10,10,1,1,1,1,1,1,1,1,2,1,10,10,10,10,10,2,2,2,4,2,1,1,1,0,0,9,9,9,9,9,,0,0,2,1,1,1,1,9,1,2,99,14,9,1,2,2,99,4,5,1,1,1,6,,9,,,8,42,2,3,,9,4,2,3,3,2,4,4,3,1,1,1,1,0,0,0,0,0,1,0,11,1,2,,2,,2,,,
23,31,2303,4,1,2,54,2.303e+10,3,888,2,2,1,24,6,2,5,0,,,99,1,1,2,4,3,,3,1,2,2,2,2,3,2,,,,,1,2,2,4,4,4,3,2,6,2,3,2,4,3,1,,77,3,0,0,0,9,9,2,2,2,2,2,2,1,2,2,2,2,2,2,2,2,99,9,9,2,2,1,3,1,3,,3,9,9,9,4,5,4,4,5,5,4,6,3,4,,5,4,4,5,4,7,5,5,4,4,3,5,6,4,4,3,2,3,4,7,5,3,2,7,6,8,6,7,5,8,10,1,3,1,1,5,7,4,3,3,1,3,2,1,4,2,1,3,3,0,0,0,0,0,1,1,0,1,0,2,1,1,2,1,2,1,2,99,3,9,2,99,2,99,3,4,1,1,1,7,2,2,2,2,13,23,2,0,,4,1,1,4,1,2,4,4,3,1,0,0,1,0,1,0,,1,0,0,,2,,,,48,3,1,,
23,32,2303,4,1,2,54,2.303e+10,3,888,2,5,1,14,8,1,3,13,0,,99,1,1,3,4,4,3,4,3,2,2,2,,,2,,,,,3,3,4,4,4,4,2,2,,2,3,2,,3,1,2,6,3,0,,0,9,9,4,1,2,2,2,2,2,2,2,2,2,2,2,2,2,99,9,9,1,2,1,2,2,4,1,9,9,9,9,7,7,7,7,7,7,7,7,7,7,7,7,7,7,7,7,7,7,7,7,7,7,5,6,4,6,3,2,,7,7,7,2,1,10,10,10,1,1,1,1,1,1,1,1,1,1,10,10,10,10,10,2,2,2,4,2,1,1,3,0,0,0,9,9,9,9,0,0,0,2,1,1,1,1,,1,1,2,99,1,1,2,2,99,4,4,1,1,1,7,2,2,2,2,10,29,3,3,,9,2,2,2,2,3,4,4,3,1,1,0,1,0,0,0,0,1,1,0,5,1,4,2,1,,1,1,,
23,33,2303,4,1,2,54,2.303e+10,3,888,2,5,1,14,8,2,3,14,,,99,1,2,3,4,4,3,4,2,2,2,2,,,2,,,,,1,3,3,4,4,3,3,3,10,2,3,2,3,,1,1,6,3,0,1,0,9,9,3,1,2,1,1,2,2,2,2,2,2,2,2,2,2,99,9,9,2,1,2,3,1,4,1,1,9,9,9,6,6,4,7,6,,4,6,5,,,5,7,3,6,7,7,,,5,6,4,5,4,6,7,6,1,3,6,7,5,2,2,10,9,8,4,1,1,1,2,6,3,1,1,1,9,2,1,2,2,2,2,2,4,2,1,1,,0,0,9,9,9,1,1,0,1,1,1,,1,,,,2,2,99,14,9,2,99,1,1,3,4,1,1,1,5,2,2,2,2,11,32,5,2,,9,4,2,4,3,1,4,4,3,1,1,0,1,1,0,0,0,1,0,0,11,2,,,,48,1,1,,
23,34,2303,4,1,2,54,2.303e+10,3,888,2,5,1,24,6,1,3,20,,,99,4,2,3,1,3,3,5,3,2,2,2,,,1,2,2,2,2,4,4,4,4,4,4,1,3,8,1,4,2,5,,1,,6,3,0,1,0,9,9,4,0,2,1,1,2,2,2,2,1,1,2,1,1,2,99,9,9,1,1,3,3,2,4,,3,3,3,4,,2,2,2,3,2,2,2,4,4,2,2,7,3,3,3,2,3,2,7,1,1,3,5,2,5,2,1,3,5,5,6,2,3,7,6,4,7,4,2,1,5,1,2,5,5,2,5,5,6,7,7,1,2,1,4,2,1,2,2,,,9,9,9,9,9,,0,0,1,1,1,2,2,,2,2,99,3,9,2,99,,99,2,3,1,2,2,2,2,2,2,2,11,34,4,6,4,2,2,1,1,1,0,5,3,3,1,1,1,1,2,1,1,0,1,1,1,,2,,,,9,,2,3,
23,35,2303,4,1,2,54,2.303e+10,3,888,2,5,1,14,8,1,5,27,,,99,1,1,1,4,3,2,3,3,2,2,2,,,1,2,1,1,,1,4,1,4,4,4,1,2,9,2,4,2,5,5,2,1,2,3,0,0,0,9,9,,1,2,2,1,1,1,2,2,1,2,2,1,1,2,99,9,9,1,3,4,3,1,4,2,4,4,4,4,7,2,1,1,1,1,3,5,1,1,1,1,3,1,1,1,1,1,1,3,2,1,2,1,1,1,1,1,3,5,4,5,3,2,9,9,,1,2,1,1,1,2,2,1,1,1,7,7,2,5,1,1,2,2,4,2,1,2,2,,,9,1,1,1,1,,1,1,1,1,1,2,1,2,1,1,1,99,1,1,1,1,1,3,5,1,6,1,6,1,2,2,2,11,42,2,6,,9,2,2,4,1,5,4,4,3,1,1,0,1,0,0,0,0,1,1,0,1,1,1,4,1,,1,2,3,
23,36,2303,4,1,2,54,2.303e+10,3,888,2,5,1,14,8,1,5,27,,,99,1,1,3,4,3,3,3,3,1,1,2,,,1,1,1,1,1,4,4,2,4,4,4,3,2,9,2,,1,3,,2,2,6,3,0,2,1,3,,,2,2,1,2,,1,2,2,2,2,2,2,,2,99,9,9,1,2,2,2,2,4,,3,3,9,3,7,5,4,5,7,5,5,6,4,4,4,5,6,3,3,3,7,3,3,5,4,4,4,4,5,6,6,4,3,4,4,5,3,2,6,6,7,4,3,3,1,9,7,4,2,2,1,7,8,8,7,1,,2,2,4,2,1,1,2,,,9,9,9,9,9,,0,0,1,1,1,,2,,1,2,99,5,9,2,99,1,1,2,4,1,5,4,5,2,2,1,2,6,55,4,4,,9,1,2,,2,7,4,4,3,1,1,1,0,1,1,0,0,1,1,0,5,2,,,,8,1,1,,
23,37,2303,4,1,2,54,2.303e+10,3,888,2,5,1,14,8,2,5,27,,,99,3,3,1,4,3,2,3,,1,2,2,,,2,,,,,1,4,4,4,4,1,1,2,6,1,3,1,5,3,2,2,2,3,0,0,0,9,9,4,1,2,2,2,2,2,2,2,1,2,2,1,1,2,99,9,9,1,2,4,3,1,4,2,3,4,4,4,6,5,1,1,1,1,1,1,1,3,5,1,1,1,1,1,1,1,1,1,1,1,5,1,1,1,1,5,1,5,5,4,3,2,4,2,,7,2,1,1,7,2,2,1,1,7,7,7,2,5,1,1,2,2,1,1,1,2,2,,,9,1,9,9,1,,1,1,1,1,1,2,1,,1,1,1,99,1,1,1,1,1,1,2,1,6,7,4,2,2,2,2,11,58,3,6,,9,2,2,4,1,2,4,4,3,1,1,0,1,0,0,0,0,1,1,0,1,1,1,5,1,,1,2,3,
23,38,2303,4,1,2,54,2.303e+10,3,888,2,5,1,14,8,2,5,13,,,99,1,1,4,4,4,3,1,2,2,2,2,,,2,,,,,2,2,2,4,,3,,2,10,2,2,2,3,3,1,2,6,4,0,2,0,9,9,4,1,2,2,2,2,2,2,2,2,2,2,2,2,2,99,9,9,1,4,1,4,2,4,2,9,4,9,9,4,3,2,,7,4,5,7,2,5,,1,7,5,,5,7,,,7,3,1,7,7,7,7,7,7,1,7,6,6,2,1,10,10,10,1,1,1,1,2,2,3,1,1,8,1,1,1,1,1,2,2,2,1,2,1,2,3,0,0,1,9,0,1,1,0,1,1,2,9,1,,1,,1,1,1,99,2,1,1,1,1,2,4,1,1,1,6,2,2,2,2,6,35,2,1,,9,4,2,,6,4,4,3,1,1,0,1,0,0,0,0,,0,0,0,9,1,4,1,2,,3,1,,
23,39,2303,4,1,2,54,2.303e+10,3,888,2,5,1,14,8,1,5,5,13,1,5,2,1,4,4,5,3,5,3,2,2,2,1,1,1,1,1,2,1,3,2,4,4,4,4,2,3,6,1,2,2,2,,3,2,6,3,0,2,0,9,9,4,2,2,2,2,2,1,2,2,2,2,2,2,2,1,7,1,,2,2,,3,1,4,2,4,9,9,9,3,4,3,3,1,1,1,4,1,1,1,2,6,1,3,3,7,4,4,4,1,1,2,1,1,1,2,1,,3,5,1,3,2,10,10,10,10,5,5,5,10,1,1,1,1,1,10,8,9,8,1,1,2,1,2,2,1,1,1,1,0,9,1,9,1,9,0,1,1,2,1,1,,1,,1,2,99,3,9,2,99,2,99,4,4,1,1,1,7,2,1,2,2,13,46,4,4,,9,2,2,2,3,9,3,5,3,1,1,0,1,0,1,1,0,1,1,0,2,1,4,1,2,,1,1,,
23,40,2303,4,1,2,54,2.303e+10,3,888,2,5,1,14,8,2,3,3,,,99,1,1,3,4,4,3,3,2,2,2,2,,,2,,,,,1,4,4,4,4,4,4,3,6,2,3,2,4,,,2,6,3,0,1,0,9,9,4,1,2,2,2,2,2,2,2,2,2,2,2,2,2,99,9,9,1,4,1,4,1,3,2,9,9,9,9,,4,4,5,5,5,5,6,5,4,,2,7,3,4,4,7,4,4,4,3,4,1,3,1,3,3,1,3,5,6,4,3,2,6,6,1,1,1,1,1,1,1,1,1,1,1,9,9,9,9,9,2,2,2,4,2,1,2,3,0,0,9,9,9,9,9,0,1,1,1,1,1,2,,,2,2,99,5,9,2,99,2,99,4,5,1,1,1,7,2,2,2,2,12,49,5,1,,9,2,1,,1,4,4,3,1,1,0,1,0,0,1,0,,1,1,0,8,2,,,,48,2,1,,
23,41,2303,4,1,2,53,2.303e+10,2,888,2,5,1,24,6,2,5,3,,,99,1,1,2,3,4,3,,,2,2,2,3,,2,,,,,1,1,4,2,4,4,3,,,2,,2,2,,1,,2,2,0,2,1,2,1,2,2,2,2,2,2,,,2,2,2,2,2,2,2,99,9,9,1,3,1,2,1,3,,3,2,9,2,4,7,3,6,6,5,4,5,5,4,4,3,4,4,5,5,7,1,5,5,4,5,1,4,4,2,2,1,4,7,7,1,3,2,10,10,10,5,1,1,1,2,1,1,1,1,1,10,10,10,10,,2,2,2,3,2,1,2,,0,,0,0,9,0,9,0,0,0,1,1,1,1,1,,1,1,2,99,3,1,2,1,,2,3,1,1,1,5,,1,1,1,11,57,2,5,,9,4,2,2,2,5,4,4,3,1,1,1,1,0,1,0,0,1,1,1,9,1,,1,1,,2,1,,
23,42,2303,4,1,2,53,2.303e+10,2,888,2,5,1,24,6,1,5,3,26,,26,1,1,1,,5,2,4,3,2,2,2,2,3,2,,,,,2,3,3,2,4,4,2,2,2,2,,2,,,,2,1,4,0,,0,9,9,4,2,2,2,2,2,2,2,2,2,2,2,2,2,2,99,9,9,1,3,1,2,2,4,,9,9,9,9,5,,4,4,,4,7,7,6,5,6,4,5,5,5,5,7,4,4,,7,5,5,5,,5,,4,2,7,7,,2,1,10,10,10,1,1,1,1,1,1,1,1,1,1,10,10,10,10,10,2,2,2,4,2,1,1,1,0,0,,,,,,,,,2,1,1,1,1,9,1,1,,99,3,1,,2,99,2,5,1,1,1,1,2,2,2,2,9,26,3,1,,9,4,,3,,7,,,,0,0,0,0,0,0,0,0,0,0,0,11,2,,,,8,1,1,,
23,43,2303,4,1,2,53,2.303e+10,2,888,2,5,1,24,6,2,3,13,,,99,1,3,3,4,4,3,4,3,2,2,2,,,2,,,,,1,2,4,4,4,4,2,1,,2,,2,3,,4,,2,,0,1,0,9,9,4,0,2,2,2,2,2,2,2,2,2,2,2,2,2,99,9,9,1,2,1,2,2,4,1,9,9,9,9,7,7,7,7,7,7,7,7,7,7,7,7,7,7,7,7,7,7,7,7,7,7,3,2,4,4,3,5,4,7,7,7,2,1,10,10,10,1,1,1,1,1,1,1,1,1,1,10,10,10,10,10,2,2,2,4,2,1,1,2,0,0,9,9,9,9,0,0,,0,2,1,1,1,1,,1,1,1,99,2,1,1,1,1,2,3,1,1,1,3,2,2,2,2,8,43,3,2,1,2,1,,3,2,3,4,4,3,1,1,0,0,0,0,0,0,0,0,0,13,,,,,,1,1,,
23,44,2303,4,1,2,53,2.303e+10,2,888,2,5,1,24,6,2,3,26,,,99,1,2,3,4,3,3,4,3,2,2,2,3,,2,,,,,1,2,4,4,4,4,,1,,2,,2,,,,,2,2,0,0,0,9,9,4,,2,2,2,2,2,2,2,2,2,2,2,2,2,99,9,9,1,2,1,2,2,4,1,9,9,9,9,6,5,6,4,4,5,4,7,6,6,,5,7,6,7,4,7,,,6,7,5,2,5,3,4,2,1,4,7,7,1,2,1,10,10,10,1,1,1,1,1,1,1,1,1,1,10,10,10,10,10,2,2,2,3,2,1,1,2,0,0,9,9,9,9,0,0,0,0,2,,1,1,1,9,1,1,1,99,2,1,1,1,1,4,1,1,1,1,7,2,2,2,2,10,28,5,1,,9,4,,4,3,2,4,4,3,1,0,0,0,0,0,0,0,0,0,0,8,1,,,2,,1,1,,
23,45,2303,4,1,2,53,2.303e+10,2,888,2,5,1,24,6,1,18,3,13,0,3,1,1,3,4,4,3,4,3,2,2,2,3,,2,,,,,3,3,4,4,4,4,2,2,,2,3,2,,,1,,1,4,0,0,0,9,9,4,1,2,2,2,2,2,2,2,2,2,2,2,2,2,99,9,9,1,3,1,3,2,4,1,9,9,9,9,,7,7,7,7,7,6,7,7,6,7,6,7,6,7,6,7,7,7,7,7,7,1,3,1,4,2,3,3,7,7,2,2,1,10,10,1,1,1,1,1,1,1,1,1,6,1,10,10,,10,10,2,2,2,4,2,1,1,3,0,0,9,9,9,9,0,0,0,,2,1,1,1,1,,1,2,99,2,9,1,2,2,99,4,,1,1,1,3,2,2,2,2,10,35,2,2,,2,1,2,2,2,4,4,3,1,1,0,1,0,0,0,0,0,0,0,0,5,1,4,,2,,1,1,,
23,46,2303,4,1,2,53,2.303e+10,2,888,2,5,1,24,6,1,3,13,,,99,1,1,2,4,4,3,4,3,2,2,2,,,2,,,,,1,3,4,4,4,,1,1,,2,2,2,3,3,4,,6,2,0,1,0,9,9,4,1,2,2,2,2,2,2,2,2,2,2,2,2,2,99,9,9,1,2,1,2,2,4,1,9,9,9,9,7,7,7,7,7,7,7,7,7,7,,7,7,7,7,7,7,,,7,7,7,5,6,4,5,2,1,5,7,7,1,2,1,10,10,10,1,1,1,1,1,1,1,1,1,1,10,10,10,10,10,2,2,2,3,2,1,1,3,0,0,9,9,9,9,0,0,,0,2,1,1,1,1,,1,1,2,99,2,1,2,2,99,4,4,1,1,1,4,2,2,2,2,10,51,5,3,,9,1,2,1,2,2,4,4,3,1,1,0,1,0,0,0,0,0,0,0,5,1,4,,,,,,,
23,47,2303,4,1,2,53,2.303e+10,2,888,2,5,1,24,6,2,5,13,,,99,2,4,4,4,2,1,3,2,1,1,2,3,,2,,,,,1,4,2,4,4,1,3,3,,2,3,1,4,4,1,2,6,3,0,3,0,9,9,3,1,2,1,1,2,1,2,2,2,2,2,,,2,99,9,9,1,2,1,3,1,4,1,9,9,9,3,,5,5,5,5,5,5,,5,5,,5,5,5,5,5,7,,,5,7,5,6,7,4,6,5,1,,7,7,1,2,2,10,10,10,1,1,1,1,1,1,1,1,1,1,10,10,10,10,10,2,2,2,4,2,1,1,3,0,0,9,9,9,9,0,0,0,0,,1,1,,1,9,1,1,1,99,2,1,1,1,1,4,5,1,1,1,1,2,2,2,2,9,35,2,3,,3,1,2,2,2,5,4,4,3,1,1,1,1,0,0,0,0,0,0,0,,1,2,3,1,,1,1,,
23,48,2303,4,1,2,53,2.303e+10,2,888,2,5,1,24,6,1,15,26,,,99,1,1,3,4,4,3,4,3,2,2,2,3,,2,,,,,3,4,4,4,4,4,1,1,,2,,2,3,,1,2,1,3,0,1,0,9,9,4,2,2,2,2,2,2,2,2,2,2,2,2,2,2,99,9,9,1,2,1,2,2,4,1,9,9,9,9,,7,6,6,6,5,6,7,6,5,7,5,7,6,7,6,7,6,7,7,7,6,2,5,2,5,5,3,3,7,7,1,2,1,10,10,10,1,1,1,1,1,1,1,1,3,1,10,10,10,10,10,2,2,2,4,2,1,1,3,0,0,9,9,9,9,0,0,0,0,2,1,1,1,1,,1,1,3,99,2,2,99,2,99,4,5,1,1,1,5,2,2,2,2,11,40,5,2,,9,4,2,2,1,2,4,4,3,1,1,0,1,0,0,0,0,0,0,0,5,1,4,,2,,1,,,
23,49,2303,4,1,2,53,2.303e+10,2,888,2,5,1,24,6,2,5,13,,,99,1,3,3,4,3,2,2,1,2,2,2,,,2,,,,,1,2,4,4,4,4,1,2,,2,,2,,3,4,,2,4,0,,0,9,9,4,1,2,2,2,2,2,2,2,2,2,2,2,2,2,99,9,9,1,2,1,2,2,4,1,1,1,9,9,,7,6,7,7,7,7,7,7,6,7,7,5,7,7,7,7,7,7,6,7,4,5,7,4,5,5,2,3,7,7,7,2,2,10,10,10,1,1,1,1,1,1,1,1,5,1,10,10,10,10,10,2,2,2,4,2,1,1,1,0,0,9,9,9,9,0,0,,0,2,1,1,1,1,,1,1,1,99,2,1,1,1,1,4,4,1,1,1,4,2,2,2,2,9,50,2,2,,9,1,2,2,2,4,4,4,3,1,1,0,0,0,0,0,0,0,0,0,13,,,,,,,,,
23,50,2303,4,1,2,53,2.303e+10,2,888,2,5,1,24,6,1,13,26,,,99,1,1,2,4,4,3,4,3,2,2,2,3,,2,,,,,2,,,,,,1,1,,2,3,2,3,,1,2,6,4,0,2,0,9,9,4,,2,2,2,2,2,2,2,2,2,2,2,2,2,99,9,9,1,2,1,3,2,4,1,9,9,9,9,,7,5,6,6,6,4,7,7,6,5,4,7,5,7,4,7,6,7,5,7,5,2,5,1,4,2,3,4,7,7,1,2,1,10,10,10,1,1,1,1,1,1,1,1,4,1,10,10,10,10,10,2,2,2,4,2,1,1,3,0,0,9,9,9,9,9,0,0,,2,1,1,1,1,,1,1,77,99,2,1,77,2,99,4,5,1,1,1,3,,9,,,9,53,2,1,,9,4,2,3,2,1,4,4,3,1,0,0,0,0,0,0,0,0,0,0,6,1,,,2,,1,,,
23,51,2302,5,2,1,17,2.302e+10,3,888,1,4,1,14,7,2,13,3,17,15,3,2,1,2,3,4,2,4,2,2,2,1,2,2,1,1,2,2,2,2,3,2,4,4,4,2,3,2,2,2,2,2,3,1,2,2,2,0,2,0,9,9,4,1,2,2,1,2,1,1,1,1,2,1,1,2,1,77,2,4,1,1,1,3,2,4,1,2,2,1,1,5,4,4,5,5,4,3,6,3,3,4,5,5,3,3,5,6,5,4,4,3,2,5,4,3,5,5,4,2,1,5,2,3,2,3,7,5,9,7,8,7,8,7,3,7,8,9,5,4,5,6,7,1,1,2,3,2,1,2,3,0,0,0,0,0,0,0,0,0,0,2,1,1,1,1,,,,99,99,9,,99,,99,4,5,4,6,2,4,2,2,2,2,18,48,2,8,,9,4,2,2,1,1,4,4,3,1,1,1,1,2,0,1,0,1,1,1,2,1,2,3,1,,2,2,,