PAIS,IDNUM,ESTRATOPRI,UPM,HAIDEPT,HAIKOMIN,SECTION,LOCATION,UR,TAMANO,SEGMENT,SEC,CLUSTER,HAIIDIOMA,DIA,MES,Q1,A4,DEM13A,DEM13B,DEM13C,DEM13D,A1,A2,A3,A4I,SOCT1,SOCT2,IDIO1,IDIO2,CP2,CP4A,CP4,PROT1,PROT2,CP5,CP5A,CP5B,CP5C,CP5D,CP6,CP7,CP8,CP9,CP10,CP13,LS3,IT1,L1,NP1,NP1B,NP2,SGL1,SGL2,LGL2,LGL3,JC15,JC16,POP1,POP2,POP3,POP4,POP5,VIC1,VIC2,AOJ1,HAIAOJ1A,AOJ1B,AOJ8,AOJ11,AOJ11A,AOJ12,AOJ16A,AOJ18,B1,B2,B3,B4,B6,B10A,B11,B13,B14,B15,B18,B20,B21,B31,B32,HAIB32A,B43,B37,N1,N3,N9,N10,N11,N12,HAIN13,M1,ING4,PN2,DEM23,PN4,PN5,E5,E8,E11,E15,E14,E2,E3,E16,D32,D33,D34,D36,D37,D1,D2,D3,D4,D5,DEM2,DEM11,AUT1,PP1,PP2,DC1,DC10,DC13,EXC2,EXC6,EXC11,EXC13,EXC14,EXC15,EXC16,EXC17,EXC18,EXC19,EXC7,GI1,GI2,GI3,GI4,GI5,VB1,VB2,HAIVB3,VB4,VB8,VB6,HAIVB7,VB10,HAIVB11,POL1,POL2,AA1,AA2,AA3,AA4,DIS2,DIS3,DIS4,DIS5,ED,Q2,Q3,Q10,Q10A,Q10B,Q10C,Q14,Q10D,Q11,Q12,HAIJEN1,HAIJEN2,HAIJEN3,HAIETID,HAIETIDA,HAILENG1,R1,R3,R4,R4A,R5,R6,R7,R8,R12,R14,R15,OCUP1,OCUP4,OCUP1A,OCUP1B1,OCUP1C,DESOC2,MIG1,MIG2,MIG3,TI
22,1,2201,1,5,46,260,260,1,2,0,0,0,1,10,9,2,15,3,0,0,,3,4,4,4,5,3,5,3,2,2,2,3,,2,,,,,4,4,2,4,4,2,4,3,,2,3,2,4,,2,,,,1,1,1,1,1,2,,,,,1,4,,4,,1,3,4,1,1,1,3,1,2,5,1,7,7,1,4,1,1,6,4,2,1,1,2,3,1,4,2,1,5,1,4,4,1,8,8,1,1,1,1,10,10,4,2,2,2,10,5,5,5,1,3,,2,1,2,1,1,1,1,1,1,1,,,,1,1,1,1,8,8,8,1,8,1,1,,,1,1,1,1,1,1,1,7,7,4,7,1,1,1,1,0,19,4,,99,,1,2,,,0,1,7,,4,4,1,0,0,0,0,0,0,0,0,0,0,0,9,1,4,,2,99,1,2,1,56
22,2,2201,1,5,46,260,260,1,2,0,0,0,1,10,9,2,13,3,0,0,,1,4,4,4,4,2,5,3,2,2,2,2,1,1,2,1,2,2,4,4,2,4,4,2,4,1,,2,4,2,5,4,4,1,,,,,,,1,2,,,,,1,,1,3,2,1,3,2,2,2,2,2,2,4,6,1,4,5,1,1,1,1,4,4,2,2,3,2,2,2,4,,4,7,4,4,2,10,10,7,5,2,2,2,7,2,2,1,1,1,6,8,6,6,1,2,2,2,,2,1,2,1,0,1,1,,,,,0,1,1,3,8,8,8,1,8,1,1,1,,1,1,1,1,1,1,1,6,7,3,7,1,1,1,1,0,41,6,,99,,4,2,2,2,5,1,7,3,4,4,1,0,0,0,1,0,0,0,1,0,0,0,9,2,,,,,1,1,,60
22,3,2201,1,5,46,260,260,1,2,0,0,0,1,10,9,2,15,4,13,24,4,3,4,4,4,4,2,4,2,2,1,2,1,1,2,,,,,1,4,1,4,4,1,3,1,,2,4,2,5,,4,2,,,1,1,1,1,1,2,,,,,1,4,1,3,2,1,1,1,1,1,1,1,1,7,7,1,7,7,1,1,1,1,1,1,1,1,1,1,1,1,1,,1,7,1,,,10,10,10,10,10,10,10,10,1,1,1,1,1,10,10,10,10,1,3,2,2,,,1,2,1,0,1,,,,,1,,,,3,1,8,8,1,8,1,1,1,,1,1,1,1,1,2,4,1,1,7,7,1,1,1,1,0,32,1,,99,,4,1,4,,2,1,5,,4,4,1,0,0,0,0,0,0,0,0,0,0,0,4,2,,,,,1,2,1,50
22,4,2201,1,5,46,260,260,1,2,0,0,0,1,10,9,2,18,1,19,27,19,3,4,4,4,3,2,4,2,2,2,2,3,,2,,,,,1,3,4,4,4,4,4,1,,2,,1,5,,2,1,2,2,2,2,1,1,1,2,,,,,1,4,1,3,2,2,1,1,1,1,1,1,1,1,1,1,1,7,1,1,1,1,1,1,1,1,1,1,1,1,4,3,7,7,1,4,3,10,10,10,10,1,1,1,10,1,1,1,1,1,10,10,10,10,1,3,2,2,,2,1,2,1,0,1,1,,,,1,0,1,1,1,8,8,8,1,8,1,1,1,,1,1,1,1,1,3,4,1,1,1,1,1,1,1,1,13,45,1,,99,,4,2,4,3,1,1,7,,4,4,1,0,0,0,1,0,0,0,0,0,0,0,4,2,,,,,1,1,,70
22,5,2201,1,5,46,260,260,1,2,0,0,0,1,11,9,1,4,3,15,19,3,1,3,4,4,4,2,4,3,2,2,2,1,1,1,1,2,1,1,4,4,2,4,4,1,4,3,,1,4,1,5,3,2,2,1,1,2,2,1,2,2,2,,,,,1,3,1,4,2,2,1,1,1,1,1,1,1,7,1,1,1,1,7,7,1,1,1,7,7,1,1,1,1,1,3,,1,7,1,4,4,10,10,10,10,1,1,1,10,1,1,1,1,1,8,8,8,8,1,3,2,2,,,1,2,1,1,1,1,,1,,,1,1,1,1,1,1,8,1,8,1,1,1,,1,1,1,1,1,1,1,7,7,7,7,1,1,1,1,10,47,3,,99,,1,2,,3,2,1,7,,4,4,1,0,0,0,0,0,0,0,0,0,0,0,5,2,,,,,1,1,,75
22,6,2201,1,5,46,260,260,1,2,0,0,0,1,11,9,1,15,1,13,24,1,1,1,4,4,5,3,5,3,2,2,2,1,1,1,1,2,1,1,4,4,1,4,4,1,4,1,1,2,4,1,3,,2,2,1,1,2,2,1,1,1,2,,,,,1,4,1,2,2,1,1,1,1,1,1,1,1,1,4,1,1,4,1,1,1,1,4,1,1,1,1,1,1,1,4,4,3,7,7,4,4,10,10,10,10,1,1,1,1,1,1,1,1,1,10,10,10,10,1,3,2,2,4,1,1,2,1,1,1,1,,1,,,1,1,0,1,1,1,1,1,1,1,1,,,1,1,,2,,1,1,1,7,1,4,1,1,1,1,14,21,3,,99,,4,2,1,1,0,1,7,,4,4,1,1,0,0,1,0,0,0,0,0,0,0,,2,,,,,1,1,,62
22,7,2201,1,5,46,260,260,1,2,0,0,0,1,11,9,1,3,1,6,19,6,3,4,4,4,4,3,5,3,2,1,2,3,,1,2,1,2,2,1,3,4,4,4,4,4,1,,2,4,2,5,,,,,,2,1,1,1,1,2,,,,,1,4,1,,2,1,1,1,1,1,1,1,1,1,7,1,1,1,1,1,1,1,1,1,1,1,1,1,1,1,3,,7,7,7,3,,10,10,10,1,1,1,1,10,1,1,1,1,1,10,10,10,10,1,2,2,2,,,1,1,1,0,0,,,,,,0,1,1,2,8,8,8,1,8,1,1,1,,1,1,1,1,1,3,2,1,7,7,7,1,1,1,1,0,38,4,,99,,4,2,,2,4,1,7,,4,4,1,0,0,0,0,0,0,0,0,0,0,0,9,2,,,,,1,1,,75
22,8,2201,1,5,46,260,260,1,2,0,0,0,1,11,9,1,21,1,17,30,30,1,3,4,4,3,3,5,1,2,2,2,3,,1,2,1,1,2,4,4,2,4,4,2,3,1,10,1,3,1,3,1,1,1,1,1,1,1,1,1,1,2,,,,,1,3,1,1,2,1,5,4,4,4,4,5,4,5,7,4,7,7,4,5,4,7,4,,4,4,4,4,3,3,6,2,7,7,7,1,1,10,10,10,1,1,1,1,1,4,4,4,4,4,8,10,10,10,1,2,2,2,4,2,1,2,1,0,0,1,1,1,,,0,1,1,2,1,1,1,1,1,1,1,1,,1,1,1,1,1,1,1,1,1,1,1,1,1,1,1,14,38,1,,99,,1,2,2,2,4,1,7,2,4,4,1,1,0,0,1,1,0,0,0,0,0,0,1,1,3,4,1,99,1,1,,55
22,9,2201,2,5,46,262,262,1,2,0,0,0,1,9,9,2,1,4,7,80,4,1,3,4,4,4,3,3,2,2,2,2,3,,2,,,,,1,4,4,4,4,4,2,3,6,2,3,2,4,,2,1,2,2,2,2,2,2,2,2,,,,,1,3,1,2,2,1,4,4,2,3,5,4,4,4,4,2,4,1,2,3,3,3,7,5,3,3,3,2,4,3,4,3,7,7,7,3,3,8,9,7,3,1,1,1,1,1,1,1,1,1,9,9,9,9,1,2,2,2,4,2,1,3,1,0,0,,,,,,0,0,0,2,1,8,1,1,8,2,2,,6,,2,,2,,4,5,1,1,3,3,,,,,11,20,5,,1,3,4,,3,1,0,1,3,,4,4,1,1,0,0,1,0,0,0,0,0,0,0,,2,,,,48,1,1,,63
22,10,2201,2,5,46,262,262,1,2,0,0,0,1,9,9,1,27,24,4,29,24,1,1,4,4,4,3,4,2,2,2,2,3,,1,1,1,1,1,2,4,2,4,4,3,2,3,8,2,3,1,4,3,2,1,2,2,2,1,1,2,2,2,,,,,2,3,1,2,2,1,4,5,1,3,4,4,3,3,4,1,5,6,3,4,3,3,7,5,3,1,3,2,4,3,4,3,7,7,7,3,3,9,9,9,3,1,1,1,1,1,1,1,1,1,9,9,9,9,4,2,2,2,4,2,1,2,1,0,0,,,,,,1,1,0,1,1,1,1,1,9,1,1,1,,1,1,11,2,,1,1,4,4,3,4,1,1,1,2,14,23,1,,1,2,1,,3,1,1,1,2,,4,4,1,1,1,1,1,0,0,0,0,0,0,0,9,2,,,,48,1,1,,63
22,11,2201,2,5,46,262,262,1,2,0,0,0,1,9,9,1,3,6,0,0,,1,4,4,4,5,3,5,3,2,2,2,1,1,2,,,,,4,3,4,4,4,2,4,3,,2,4,2,5,,2,1,1,1,1,1,1,1,1,2,,,,,1,4,1,4,2,2,2,2,2,2,2,2,1,3,4,2,2,7,3,1,1,1,7,3,1,1,1,1,1,1,2,,4,6,4,4,4,10,10,10,1,1,1,1,10,1,1,1,1,1,10,10,8,8,1,2,2,2,1,2,1,2,1,1,1,1,,,,,1,1,1,1,1,1,1,1,8,1,1,1,,1,1,1,1,1,1,1,7,7,2,4,1,1,1,1,13,25,1,,99,,2,1,3,1,0,1,7,3,4,4,1,1,1,0,1,0,0,0,0,0,0,0,9,2,,,,,1,1,,55
22,12,2201,2,5,46,262,262,1,2,0,0,0,1,9,9,2,15,1,17,27,27,1,2,4,4,4,3,4,3,2,2,2,3,,2,,,,,2,4,4,4,4,4,3,2,,2,,2,5,,2,2,1,1,2,2,2,2,2,2,,,,,1,4,1,4,2,2,3,1,1,1,1,1,1,5,5,1,2,7,1,1,1,1,7,3,1,1,1,1,1,1,1,4,7,7,3,4,4,10,10,10,10,1,1,1,10,1,1,1,1,1,10,10,10,10,1,2,2,2,1,2,1,2,1,1,1,1,,1,,,1,1,1,1,1,1,1,1,8,1,1,2,,3,1,2,2,,3,4,3,1,3,3,1,1,1,1,14,27,1,,99,,1,1,3,1,0,1,5,,4,4,1,1,1,0,1,0,0,0,0,0,0,0,12,,,,,99,1,1,,62
22,13,2201,2,5,46,262,262,1,2,0,0,0,1,9,9,1,24,1,10,15,10,1,2,3,4,4,2,4,2,2,2,2,3,,1,2,2,1,2,2,1,3,2,1,2,2,1,7,2,3,2,4,4,,,2,2,1,2,2,1,2,2,,,,,2,2,3,3,2,1,7,7,7,7,7,5,5,7,7,5,6,7,5,4,4,4,7,5,4,3,4,4,4,4,5,3,7,7,5,2,2,10,10,10,1,1,1,1,1,1,1,1,1,1,10,10,10,10,4,2,2,2,4,2,2,2,2,0,0,,,,1,1,1,1,0,2,1,1,1,1,1,1,1,2,,3,1,2,2,,3,4,1,1,1,7,1,1,2,2,13,32,1,1,1,2,1,2,,1,2,1,1,,4,4,1,1,1,0,1,0,0,0,0,0,0,0,12,,,,,99,1,1,,61
22,14,2201,2,5,46,262,262,1,2,0,0,0,1,9,9,2,2,8,12,27,12,2,2,3,3,4,2,4,2,2,2,2,3,,1,1,2,1,1,2,1,2,3,1,2,2,1,6,2,3,2,4,4,,2,2,2,2,,2,1,2,2,,,,,2,2,3,3,2,1,5,6,7,6,7,5,4,7,7,5,6,7,5,4,4,3,7,6,4,3,1,4,4,4,6,,7,7,7,2,2,10,10,10,1,1,1,1,1,1,1,1,1,1,10,10,10,10,1,2,2,2,,,2,2,2,0,0,1,,,1,1,1,1,0,2,1,1,1,1,1,1,1,1,,2,1,1,2,,3,3,1,1,1,7,1,1,2,2,14,35,1,2,4,2,1,2,1,3,2,1,1,,4,4,1,1,1,0,1,0,0,0,0,0,0,0,4,2,,,,,1,1,,70
22,15,2201,2,5,46,262,262,1,2,0,0,0,1,9,9,1,5,3,0,0,,3,3,3,4,5,3,4,2,2,2,2,3,,1,1,1,1,1,4,2,2,4,4,3,2,3,,2,3,2,4,3,4,1,2,2,2,2,2,2,2,2,,,,,2,3,1,3,2,1,4,4,3,3,4,4,4,4,4,2,5,6,2,2,3,3,7,5,3,3,3,3,3,3,4,4,7,7,7,3,3,9,9,9,1,1,1,1,1,1,1,1,1,1,9,9,9,9,1,2,2,2,4,2,1,1,1,0,0,0,0,,,0,0,0,0,2,1,8,1,1,8,1,1,7,,3,1,6,2,,3,4,1,4,5,5,,,,,11,50,1,5,99,,4,,3,2,3,2,,,4,4,1,1,1,1,1,0,0,0,0,0,0,0,3,1,2,,,99,2,1,,62
22,16,2201,2,5,46,262,262,1,2,0,0,0,1,9,9,2,5,3,19,0,,3,3,3,4,5,3,4,3,2,2,2,1,2,2,,,,,1,3,4,3,4,4,3,3,,2,,2,4,,2,1,,,,,2,1,2,2,,,,,1,3,1,1,,1,2,5,4,2,4,2,3,3,4,2,2,2,1,1,1,1,7,2,1,1,,,1,1,1,,,7,2,3,3,10,6,6,2,1,1,1,10,2,3,2,4,2,,10,,6,1,2,2,2,4,2,1,2,1,1,0,,,,0,,0,1,0,1,1,8,2,1,8,1,1,1,,1,1,,2,,4,4,1,1,1,7,1,,,,11,49,1,0,99,,1,1,3,2,1,1,1,,4,4,1,1,1,0,1,0,0,0,1,0,0,0,4,2,,,,,1,1,,64
22,17,2201,3,5,46,264,264,1,2,0,0,0,1,10,9,2,1,32,3,11,32,3,3,3,4,4,2,3,2,2,2,2,3,,2,,,,,1,4,2,4,4,4,2,2,7,2,3,2,4,,2,1,2,2,2,2,2,2,2,2,,,,,2,2,1,3,2,1,3,4,2,3,4,3,3,3,3,1,5,6,3,3,4,4,7,4,3,3,3,2,3,3,4,3,7,7,7,3,3,9,9,9,2,1,1,1,1,1,1,1,1,1,9,9,9,9,6,2,2,2,4,2,1,1,1,0,0,,,,,,0,0,0,1,1,8,1,1,8,1,1,1,,1,1,,2,,3,4,1,1,1,1,,,,,12,23,1,,1,2,4,,3,1,0,1,2,,4,4,1,1,1,0,1,0,0,0,0,0,0,0,12,,,,,99,2,1,,65
22,18,2201,3,5,46,264,264,1,2,0,0,0,1,10,9,1,15,32,4,26,4,3,3,3,4,4,3,3,2,2,2,2,3,,1,1,1,1,1,4,4,2,4,4,3,2,3,8,2,4,2,5,5,2,1,2,2,2,2,2,2,2,2,,,,,2,2,1,3,2,1,2,2,2,2,3,2,3,3,3,1,5,5,2,2,1,1,7,3,2,2,2,1,2,2,3,4,7,7,7,4,4,8,10,8,1,1,1,1,1,1,1,1,1,1,10,10,10,10,1,2,2,2,4,2,1,1,1,0,0,,,,,,1,0,0,1,1,1,1,1,1,1,1,1,,3,1,1,2,,1,1,1,4,2,1,1,,2,2,9,20,1,,99,,4,,3,1,0,1,3,,4,4,1,1,1,1,1,0,0,0,1,0,1,0,12,,,,,99,2,1,,75
22,19,2201,3,5,46,264,264,1,2,0,0,0,1,10,9,1,1,26,19,4,4,3,3,4,4,4,2,4,2,2,2,2,3,,2,,,,,4,4,4,4,4,3,3,3,7,2,3,2,4,,2,1,2,2,2,2,2,2,2,2,,,,,2,3,1,3,2,1,3,3,3,3,,3,3,3,3,2,4,5,2,2,3,3,7,5,3,2,2,2,3,2,4,4,7,7,7,3,3,9,10,9,1,1,1,1,1,1,1,1,1,1,9,9,9,9,1,2,2,2,4,2,1,1,1,0,0,0,0,,,0,1,0,0,2,1,8,1,1,8,1,1,1,,3,1,1,2,,2,2,1,3,4,5,1,1,1,2,13,52,1,,99,,4,,3,3,3,1,1,,4,4,1,1,1,0,1,0,0,0,0,0,0,0,2,1,2,,2,99,1,1,,62
22,20,2201,3,5,46,264,264,1,2,0,0,0,1,10,9,2,3,4,9,24,4,3,3,4,4,4,3,4,2,2,2,2,3,,2,,,,,4,3,4,4,4,4,4,4,,2,4,2,2,,2,,,,,1,1,1,1,2,,,,,2,3,1,4,2,,1,2,1,1,,1,2,2,2,1,3,5,2,,3,3,7,4,1,1,1,1,1,1,2,4,,7,,,,8,10,7,,1,1,1,1,1,1,1,1,1,7,7,7,7,1,2,2,2,4,2,1,3,1,0,0,,0,,0,0,1,0,0,1,1,8,1,1,8,1,1,1,,1,1,1,2,,2,4,1,1,4,5,1,1,1,2,14,40,1,,99,,4,,3,2,2,1,1,,4,4,1,1,1,1,1,0,0,0,0,0,1,0,3,1,2,,,99,2,1,,65
22,21,2201,3,5,46,264,264,1,2,0,0,0,1,10,9,1,3,4,7,8,4,3,3,3,4,4,2,4,2,1,2,1,3,,1,1,2,1,2,4,3,2,4,4,3,4,3,8,2,3,2,4,,2,1,2,2,2,1,1,1,2,1,2,1,1,,2,3,1,3,2,2,2,2,2,2,3,3,3,3,3,2,3,4,2,3,3,3,7,4,2,2,2,2,2,2,4,4,7,7,7,3,3,8,9,7,1,1,1,1,1,1,1,1,1,1,9,9,9,9,3,2,2,2,4,2,1,1,1,0,0,,0,0,,,1,1,0,2,1,8,1,1,8,1,1,1,,3,1,8,2,,1,1,2,3,4,5,,,,,18,35,1,,99,,4,1,3,3,1,2,,,4,4,1,1,1,1,1,0,0,0,0,0,0,0,3,1,2,,,99,2,1,,63
22,22,2201,3,5,46,264,264,1,2,0,0,0,1,10,9,2,3,4,15,27,4,3,3,3,3,4,2,3,2,2,2,2,3,,1,1,2,1,2,2,3,2,2,4,4,2,2,9,2,3,2,4,,4,1,2,2,2,2,2,2,2,2,,,,,2,2,1,3,2,1,2,2,2,2,,,,,,,,,,,,,,,,,,,,,,,,,,3,3,8,9,8,1,1,1,1,1,1,1,1,1,1,9,9,9,9,1,2,2,2,4,2,1,1,1,0,0,,,,0,,0,0,0,2,1,8,1,1,8,1,1,1,,1,1,4,2,,3,4,1,1,3,3,,,,,13,31,1,,3,2,1,,3,1,1,2,,,4,4,1,1,1,1,1,0,0,0,0,0,1,0,4,1,4,,2,99,1,1,,68
22,23,2201,3,5,46,264,264,1,2,0,0,0,1,11,9,2,2,4,10,32,4,3,3,3,4,4,3,3,2,2,2,2,3,,2,,,,,2,3,4,4,4,4,2,2,,2,3,2,4,,2,1,,,,,,,2,2,,,,,2,3,1,3,2,1,3,3,3,3,4,3,4,4,4,2,5,6,2,2,2,2,7,6,2,1,2,1,2,2,3,,,7,,,,7,10,7,1,1,1,1,1,1,1,1,1,1,9,9,9,9,1,1,1,1,4,2,1,2,1,0,0,0,,,0,0,1,1,1,2,1,8,8,1,8,1,1,1,,1,1,1,2,,3,4,2,3,4,6,,,,,9,57,1,,3,2,1,1,3,3,4,1,2,,4,4,1,1,1,1,1,0,0,0,0,0,0,0,4,1,4,,2,99,1,1,,71
22,24,2201,3,5,46,264,264,1,2,0,0,0,1,11,9,1,15,32,26,4,32,1,3,3,4,4,2,4,2,1,1,1,1,2,1,2,1,1,2,4,4,2,4,4,3,3,3,7,2,3,2,4,5,2,1,2,2,2,2,2,2,2,2,,,,,2,3,1,3,2,2,3,2,2,3,4,3,2,2,2,1,4,5,2,3,3,3,7,4,3,3,3,2,3,2,4,4,7,7,7,3,3,8,9,8,1,1,1,1,1,1,1,1,1,1,9,9,9,9,4,2,2,2,4,2,1,1,1,0,0,,,,,,1,1,1,2,1,8,1,1,8,1,1,1,,3,1,,2,,2,2,3,4,4,4,1,1,2,2,9,29,1,,99,,4,,3,1,0,2,,,4,4,1,1,0,0,1,0,0,0,0,0,0,0,,2,,,,48,1,1,,83
22,25,2201,4,5,46,265,265,1,2,0,0,0,1,12,9,1,15,4,32,15,32,1,1,1,4,4,2,3,2,2,2,2,3,,1,1,2,1,2,4,4,2,4,4,4,2,2,8,2,4,2,5,,2,1,2,2,2,1,1,1,2,2,,,,,2,3,1,3,2,2,3,4,2,3,4,2,3,3,3,2,3,5,2,2,3,3,7,3,2,2,2,2,2,2,3,4,7,7,7,4,4,9,9,9,1,1,1,1,1,1,1,1,1,1,9,9,9,9,1,2,2,2,4,2,1,1,1,0,0,0,,,,,1,1,0,1,1,8,1,1,8,1,1,1,,3,1,,2,,1,1,3,3,4,4,,,,,10,62,1,10,4,2,1,,3,6,5,1,1,,4,4,1,1,1,1,1,0,0,0,0,0,0,0,,2,,,,,1,1,,62
22,26,2201,4,5,46,265,265,1,2,0,0,0,1,12,9,2,3,32,7,4,32,1,3,4,4,4,3,3,2,2,2,2,3,,2,,,,,2,2,4,4,4,4,2,3,7,2,3,2,4,,2,1,2,2,2,1,1,1,2,2,,,,,2,3,1,3,2,,4,4,2,4,4,4,3,3,3,2,5,6,2,4,3,3,7,6,2,2,2,2,2,2,3,3,,7,,,,7,9,7,1,1,1,1,1,1,1,1,1,1,9,9,9,9,1,1,1,1,4,2,1,3,1,0,0,,,,0,,1,1,0,1,1,8,1,1,8,1,2,,3,,2,,2,,3,4,1,1,4,5,1,1,1,2,11,59,1,,1,3,4,1,3,2,3,2,,,4,4,1,1,1,0,1,0,0,0,0,0,0,0,,2,,,,,2,1,,67
22,27,2201,4,5,46,265,265,1,2,0,0,0,1,12,9,2,2,4,17,80,4,3,3,4,4,4,3,4,3,2,2,2,3,,2,,,,,1,3,4,4,4,4,4,3,,2,4,2,5,,2,1,2,2,2,2,2,2,2,1,2,2,,1,2,4,1,4,2,2,1,1,1,1,2,1,2,2,2,1,2,5,2,1,2,2,5,4,1,1,1,1,1,1,3,4,,7,,,,7,9,7,2,1,1,1,1,1,1,1,1,1,9,9,9,9,1,1,2,1,4,2,1,1,1,0,0,,,,0,0,1,0,0,2,8,8,2,1,8,1,1,1,,1,1,1,2,,4,4,,1,5,6,,,,2,3,42,1,,99,,4,,4,3,3,1,1,,4,4,1,0,0,0,0,0,0,0,0,0,0,0,4,1,4,,2,99,2,1,,76
22,28,2201,4,5,46,265,265,1,2,0,0,0,1,12,9,1,15,26,4,32,4,1,3,3,4,4,3,3,2,1,2,1,2,2,1,1,1,1,1,4,2,2,4,2,3,2,3,8,2,3,1,4,4,2,1,2,2,2,2,2,2,2,1,2,1,1,,2,4,1,3,2,1,2,2,2,2,4,2,3,3,3,3,3,5,2,2,3,3,7,4,2,2,2,2,2,2,4,4,7,7,6,3,3,8,9,7,3,1,1,1,1,1,1,1,1,1,9,9,9,9,2,2,2,2,4,2,1,1,1,0,0,0,0,,,0,1,1,1,2,1,1,1,1,8,1,1,1,,3,1,,2,,2,2,3,3,3,3,1,1,2,2,12,38,1,,1,3,1,,3,3,2,2,,,4,4,1,1,1,1,1,0,0,0,0,0,0,0,10,1,1,,2,99,3,1,,72
22,29,2201,4,5,46,265,265,1,2,0,0,0,1,13,9,2,15,4,17,32,4,1,3,4,4,4,3,4,1,2,2,2,3,,2,,,,,1,4,4,4,4,4,3,3,6,2,4,2,4,,2,,,,2,1,1,1,2,2,,,,,2,3,1,3,2,2,3,3,1,3,5,3,3,3,3,2,2,6,3,3,4,4,7,6,2,2,3,2,2,2,3,4,7,7,7,3,3,5,9,5,2,2,1,1,1,1,1,1,1,1,7,8,7,7,2,2,2,2,3,2,1,2,1,0,0,,,,,,0,0,0,2,1,8,2,1,8,1,2,,7,,2,,2,,3,4,2,4,4,5,1,1,2,2,11,22,1,,1,3,4,,3,1,0,1,2,,4,4,1,0,0,1,1,0,0,0,0,0,0,0,,2,,,,,1,1,,66
22,30,2201,4,5,46,265,265,1,2,0,0,0,1,13,9,1,15,3,15,32,32,4,4,3,4,4,1,4,3,1,1,1,1,1,1,1,1,1,1,1,2,4,4,4,2,2,3,4,1,3,1,4,3,2,1,2,2,2,2,1,2,2,2,,,,,2,4,1,3,2,1,2,4,3,3,5,3,3,3,2,2,3,5,4,4,4,3,7,6,3,3,3,3,2,2,2,5,5,6,5,4,2,7,9,7,2,2,1,1,1,4,1,1,1,1,8,9,7,9,1,2,2,2,4,1,1,1,1,0,0,1,,,,,1,1,1,2,1,8,2,1,8,1,1,1,,3,1,,2,,1,1,6,6,7,5,1,1,2,2,12,21,1,,1,3,1,1,3,1,0,1,2,,4,4,1,0,0,1,1,0,0,0,0,0,0,0,,2,,,,42,1,1,,72
22,31,2201,4,5,46,265,265,1,2,0,0,0,1,13,9,2,27,4,17,27,4,1,3,3,4,4,2,4,2,2,2,2,3,,1,2,1,1,2,1,4,2,4,4,4,3,3,6,2,4,2,4,,2,,2,2,2,2,2,2,2,2,,,,,2,3,1,3,2,1,2,3,2,3,4,2,3,3,2,2,5,6,3,2,3,3,6,5,2,2,2,2,2,2,3,4,7,7,6,4,4,7,9,7,3,1,1,1,1,1,1,1,1,1,8,9,7,7,1,2,2,2,4,2,1,3,1,0,0,,,,0,,1,1,1,2,8,8,2,1,8,1,1,1,,1,1,1,2,,3,4,1,1,5,4,1,,2,2,9,28,1,,99,,4,2,3,1,0,1,3,2,4,4,1,1,0,1,1,0,0,0,0,0,0,0,,2,,,,,1,1,,78
22,32,2201,4,5,46,265,265,1,2,0,0,0,1,13,9,1,27,26,4,32,4,1,3,3,4,4,3,4,1,1,1,1,1,1,1,1,1,1,1,1,4,1,4,4,2,2,3,8,2,3,1,4,,2,1,2,2,2,2,2,2,2,2,,,,,2,3,1,3,2,1,3,3,2,3,5,3,4,4,4,2,4,5,2,3,3,3,7,5,2,2,3,2,3,2,3,4,6,6,6,3,3,5,9,5,2,1,1,1,2,1,1,1,1,1,7,9,8,8,3,2,2,2,4,2,1,1,1,0,0,0,,,,,0,1,1,2,1,1,1,1,8,1,1,1,,3,1,,2,,2,2,3,5,5,6,1,1,2,2,14,30,1,,1,3,1,,3,1,0,2,,,4,4,1,1,1,1,1,0,0,0,0,0,0,0,,2,,,,,1,1,,73
22,33,2201,5,5,46,266,266,1,2,0,0,0,1,10,9,1,19,18,13,3,13,1,2,3,4,3,2,3,2,2,2,2,1,1,1,1,2,1,2,1,3,2,3,3,1,2,1,,2,3,2,3,3,2,1,,,1,2,2,2,2,2,,,,,1,2,2,4,2,1,1,1,1,1,1,1,4,6,7,4,5,7,5,4,2,4,7,5,1,1,1,1,1,2,6,,7,7,7,2,2,7,1,4,1,1,1,1,2,1,1,1,1,1,7,7,7,7,1,2,,2,4,,,,,0,0,,,,1,1,0,0,0,3,1,1,1,1,1,1,1,1,,2,1,1,1,1,4,,4,4,1,6,,,,,14,29,,,99,,4,1,1,1,1,2,,,4,4,1,0,0,0,0,0,0,0,0,0,0,0,9,2,,,,,1,1,,75
22,34,2201,5,5,46,266,266,1,2,0,0,0,1,10,9,1,31,11,22,3,11,1,3,4,4,3,2,3,2,,,,3,,1,2,1,1,1,2,4,3,4,4,1,2,2,3,2,2,2,4,4,1,2,2,2,1,1,2,1,1,2,,,,,1,1,1,2,,1,4,6,5,6,5,4,4,6,7,2,4,7,5,4,3,2,7,5,2,3,3,4,3,2,6,3,5,6,2,2,2,8,7,5,1,1,3,1,2,6,3,1,1,2,,7,4,3,1,2,2,2,3,2,1,1,1,0,1,,,,,,1,1,0,4,1,1,1,1,1,1,1,1,,3,1,1,1,1,3,3,1,1,2,6,1,1,2,2,11,48,5,,99,,4,2,,1,0,2,,,4,4,1,1,0,0,1,0,0,0,0,0,0,0,12,,,,,99,1,1,,70
22,35,2201,5,5,46,266,266,1,2,0,0,0,1,10,9,1,3,5,12,16,12,1,2,4,4,4,2,4,2,2,2,2,1,1,1,1,2,1,1,1,3,3,4,4,1,2,2,,2,4,2,4,4,,,2,2,2,2,2,2,2,2,,,,,2,1,1,4,,,1,1,1,1,1,3,4,6,7,,4,6,5,4,3,2,7,5,1,1,1,2,3,1,6,3,6,7,1,2,2,7,4,4,1,1,1,1,2,1,1,1,1,1,4,6,4,5,3,2,2,2,4,2,,,,0,0,,,,,,0,0,0,3,1,1,1,1,8,1,1,,,3,1,1,2,,4,5,3,2,1,6,1,1,2,2,12,31,1,,99,,4,2,1,1,0,2,,,,,,0,0,0,0,0,0,0,0,0,0,0,12,,,,,99,1,1,,55
22,36,2201,5,5,46,266,266,1,2,0,0,0,1,10,9,1,24,26,6,12,12,1,2,4,4,4,3,4,3,2,2,2,1,1,1,1,2,1,1,1,3,3,4,1,1,4,2,5,2,4,2,4,4,,,2,2,1,2,2,1,2,2,,,,,1,1,1,4,2,1,1,1,1,1,1,3,1,6,6,3,4,6,5,3,2,3,6,4,1,3,2,1,2,1,6,4,4,6,1,3,2,7,2,4,1,1,1,1,1,1,1,1,1,1,2,6,4,3,1,2,2,2,,2,1,1,1,0,0,,,,1,1,1,1,0,2,1,1,1,1,1,1,1,1,,1,1,1,2,,3,4,3,2,1,6,1,1,2,2,11,24,1,,99,,4,2,1,1,0,,3,,4,4,1,1,1,0,1,0,0,0,0,0,0,0,12,,,,,99,1,1,,55
22,37,2201,5,5,46,266,266,1,2,0,0,0,1,11,9,2,24,29,12,20,12,1,4,4,4,5,3,5,3,2,2,2,3,,1,1,2,1,1,1,3,4,4,4,4,3,1,5,2,3,2,4,5,,2,,,,,,,,2,,,,,2,1,1,4,,1,4,6,7,5,6,4,5,6,6,4,5,7,5,4,4,3,7,5,3,4,3,2,4,1,6,3,1,5,1,2,2,7,6,5,2,1,1,1,1,1,1,1,1,1,4,7,5,3,1,,2,2,,2,,,,0,0,1,,1,,,0,0,0,3,8,8,1,1,8,,1,1,,2,1,1,1,,3,5,1,2,1,6,1,1,2,2,0,49,1,,99,,4,1,,3,2,1,3,,,,,0,0,0,0,0,0,0,0,0,0,0,6,2,,,,,1,1,,50
22,38,2201,5,5,46,266,266,1,2,0,0,0,1,11,9,2,2,19,27,10,10,2,2,3,4,4,3,4,3,2,2,2,3,,1,1,2,1,2,1,3,3,3,4,1,2,2,4,2,3,2,4,4,,,,,2,2,2,1,2,2,,,,,1,1,2,4,,,1,1,1,1,1,3,4,6,6,4,5,7,5,3,4,2,7,4,1,1,3,4,3,1,6,3,5,6,1,2,2,6,5,4,1,1,1,1,1,2,2,2,2,2,4,6,3,4,1,2,2,2,4,2,1,1,1,1,1,,,,,,1,1,0,4,1,1,1,1,1,1,1,1,,1,1,1,1,1,3,3,3,2,1,6,1,1,2,2,13,36,1,,99,,4,1,1,1,0,1,1,,4,4,1,1,0,0,1,0,0,0,0,0,0,0,12,,,,,99,1,1,,65
22,39,2201,5,5,46,266,266,1,2,0,0,0,1,11,9,2,57,11,13,33,11,1,3,4,4,4,2,4,2,2,2,2,1,1,1,1,2,1,1,1,1,3,4,4,1,3,2,5,2,2,2,4,4,,,2,2,,,,1,1,2,,,,,2,2,3,4,2,,1,4,2,5,5,5,2,6,7,4,3,6,4,3,4,1,7,4,1,4,3,1,1,1,6,,4,6,1,2,2,7,4,5,1,1,1,,,1,1,1,1,1,5,10,4,5,1,,2,2,,2,1,2,2,0,0,,,,,,0,0,0,3,1,1,1,1,1,2,2,,3,,2,,2,,4,5,2,1,1,6,1,1,2,2,13,30,1,3,3,2,1,2,1,1,1,2,,,4,4,1,1,0,0,1,0,0,0,0,0,0,0,12,,,,,99,1,1,,53
22,40,2201,5,5,46,266,266,1,2,0,0,0,1,11,9,2,19,10,12,29,12,1,4,4,4,4,2,4,2,2,2,2,3,,1,1,2,1,2,1,2,3,4,4,4,3,1,6,2,4,2,4,5,,,2,2,1,2,2,1,1,2,,,,,2,1,1,4,2,,3,1,2,5,4,1,4,6,5,2,2,6,4,2,5,1,7,3,1,1,1,1,1,1,6,3,1,4,3,2,2,7,5,2,1,1,1,1,1,1,1,1,1,1,,,4,5,1,2,2,2,,,1,1,1,0,0,0,0,,,,0,0,0,4,1,1,1,1,8,1,1,1,,2,1,1,1,1,2,,3,4,2,5,1,1,2,2,12,24,1,,99,,4,2,1,1,0,2,,,4,4,1,0,0,0,1,0,0,0,0,0,0,0,12,,,,,99,1,1,,50
22,41,2201,6,5,49,275,275,2,5,1,0,0,1,14,9,1,5,6,27,19,6,1,4,4,4,4,2,4,2,2,1,2,1,1,1,1,2,1,2,4,4,2,4,4,1,4,1,,1,4,1,5,2,2,2,2,2,2,2,2,2,2,2,,,,,1,4,1,4,2,2,3,2,2,2,2,2,1,2,4,1,1,1,6,1,1,1,7,1,1,1,1,1,1,1,4,3,7,7,4,4,4,10,10,10,10,1,1,1,10,1,1,1,1,1,6,10,6,5,1,2,2,2,4,1,1,1,1,1,1,,,1,,,0,1,1,1,8,8,8,1,8,1,1,1,,1,1,1,1,1,1,1,7,7,3,3,1,1,1,1,7,22,3,,99,,3,2,4,1,0,1,4,,4,4,1,0,0,0,0,0,0,0,0,0,0,0,9,2,,,,,1,1,,68
22,42,2201,6,5,49,275,275,2,5,1,0,0,1,14,9,2,5,3,0,0,,3,3,3,4,5,3,4,2,2,2,2,3,,2,,,,,2,3,4,4,4,4,3,3,,2,4,2,4,,4,1,,,,,2,1,1,2,,,,,1,3,1,1,2,1,,4,1,1,1,,,1,1,2,2,1,1,1,1,1,7,2,,,,1,1,1,1,,,7,,3,4,10,10,10,4,1,1,1,8,2,2,1,1,1,,10,10,10,1,2,2,2,4,2,1,2,2,0,0,,,,0,0,0,1,0,1,1,8,2,1,8,1,1,1,,1,1,,2,,4,5,1,1,3,6,1,,,,11,24,1,,99,,2,1,3,1,1,2,,,4,4,1,0,0,0,1,0,0,0,0,0,0,0,,2,,,,,1,1,,66
22,43,2201,6,5,49,275,275,2,5,1,0,0,1,14,9,1,58,6,17,23,6,1,4,4,4,3,2,4,1,2,2,2,3,,2,,,,,4,4,2,4,4,1,3,1,,1,2,1,4,2,1,1,2,2,1,1,1,1,1,2,,,,,2,1,2,3,2,2,1,1,1,1,1,1,1,1,1,1,1,7,1,1,2,2,7,4,1,1,1,1,1,1,3,3,7,7,7,4,4,10,10,10,10,1,1,1,10,1,1,1,1,1,10,10,10,10,1,2,2,2,1,2,1,2,1,1,1,1,,,,,0,1,1,1,1,1,1,1,8,1,1,3,,3,1,2,1,2,1,1,7,7,7,7,1,1,1,1,13,30,1,,99,,4,1,4,1,1,1,6,,4,4,1,0,0,0,0,0,0,0,0,0,0,0,9,1,4,,2,99,1,1,,65
22,44,2201,6,5,49,275,275,2,5,1,0,0,1,14,9,2,3,6,27,30,27,3,4,4,4,4,2,4,2,2,2,2,3,,2,,,,,4,3,4,4,4,4,1,1,,2,,2,4,,2,1,1,1,1,1,1,1,1,1,1,1,1,,1,4,1,4,2,2,1,1,1,1,1,1,1,4,4,1,1,4,1,1,1,1,7,4,1,1,1,1,1,1,1,4,4,7,4,4,4,10,10,10,10,1,1,1,1,1,1,1,1,1,8,10,8,8,1,2,2,2,1,2,1,2,1,1,1,1,1,,,1,0,1,1,1,1,1,1,1,8,1,1,1,,3,1,2,2,,1,1,1,1,1,5,1,1,1,1,13,28,1,,99,,3,1,4,1,0,1,3,,4,4,1,0,0,0,1,0,0,0,0,0,0,0,,2,,,,,1,1,,70
22,45,2201,6,5,49,275,275,2,5,1,0,0,1,15,9,1,4,7,13,19,19,1,4,4,4,4,3,4,3,2,2,2,3,,2,,,,,1,3,4,4,4,4,1,3,,2,4,2,4,,2,2,1,1,1,1,1,1,1,2,,,,,1,1,1,1,2,1,5,1,1,1,1,5,3,4,4,1,7,7,1,5,1,1,6,4,1,1,1,3,4,1,4,2,7,7,7,3,3,10,8,8,1,1,1,1,10,1,1,1,1,1,8,10,8,8,1,2,2,2,,2,1,1,1,0,0,,,,,,0,1,1,1,1,8,1,1,8,1,1,1,,1,1,1,1,1,1,1,7,7,7,7,1,1,1,1,4,33,1,,99,,4,2,4,1,2,1,5,,4,4,1,0,0,0,0,0,0,0,0,0,0,0,9,2,,,,,1,1,,66
22,46,2201,6,5,49,275,275,2,5,1,0,0,1,15,9,2,15,3,0,0,,2,4,4,4,4,2,4,2,2,2,2,3,,2,,,,,4,4,4,4,4,4,4,2,,2,3,2,4,,,2,2,2,1,1,1,1,1,2,,,,,1,4,1,1,2,1,1,1,1,1,1,1,1,4,5,1,5,5,1,1,1,1,7,4,1,1,1,1,1,1,4,3,5,7,5,2,2,10,10,6,1,1,1,1,1,1,1,1,1,1,,10,10,8,1,2,2,2,1,2,1,2,1,0,1,1,,,,,0,1,1,2,1,8,8,1,8,1,1,1,,1,1,1,1,1,1,1,1,1,4,4,1,1,1,1,0,40,1,,99,,4,2,4,3,3,1,4,,4,4,1,0,0,0,0,0,0,0,0,0,0,0,4,2,,,,,1,1,,75
22,47,2201,6,5,49,275,275,2,5,1,0,0,1,15,9,1,15,6,13,24,6,1,4,4,4,3,1,4,2,2,2,2,3,,2,,,,,3,3,4,4,4,1,1,1,,1,2,1,4,2,2,,2,2,1,1,1,2,2,2,,,,,1,2,1,1,2,1,4,3,2,2,2,4,7,7,7,7,7,5,4,4,3,2,7,4,2,2,3,3,2,1,4,,6,7,6,2,2,10,10,10,1,1,1,1,10,2,2,2,1,1,10,10,10,10,1,2,2,2,,2,1,2,1,0,1,,,,,,0,0,1,3,1,1,1,1,8,1,1,1,,3,1,1,1,1,1,1,1,7,3,5,1,1,1,1,11,49,1,,99,,3,1,3,2,3,1,4,,4,4,1,0,0,0,0,0,0,0,1,0,0,0,,2,,,,,1,1,,77
22,48,2201,6,5,49,275,275,2,5,1,0,0,1,15,9,2,4,19,20,6,20,1,4,4,4,4,,4,2,2,2,2,1,1,1,2,1,1,2,4,4,2,4,4,1,4,1,,2,4,2,5,,4,2,2,2,2,2,2,2,2,2,,,,,2,2,1,1,2,1,7,3,3,3,3,5,1,4,7,7,7,7,3,7,4,4,7,4,3,3,3,3,3,2,4,3,7,7,7,1,1,10,10,10,3,1,3,1,8,1,1,1,1,1,10,10,10,10,1,2,2,2,4,2,1,2,1,0,0,1,,,,1,0,1,1,1,8,8,8,1,8,1,1,1,,3,1,1,1,1,1,1,7,7,2,7,1,1,1,1,11,52,1,0,99,,3,1,4,2,4,1,4,,4,4,1,0,0,0,0,0,0,0,0,0,0,0,13,,,,,99,1,1,,74
22,49,2201,7,5,56,314,314,2,5,0,0,0,1,12,9,1,1,6,0,0,,1,4,4,4,4,3,5,3,2,2,2,1,1,1,2,1,2,2,,,2,,,2,4,1,,1,3,1,5,3,4,1,1,1,1,1,1,1,1,2,,,,,2,2,2,1,2,1,4,1,1,1,1,3,1,1,7,1,4,1,1,1,1,1,7,4,3,2,3,3,3,1,3,3,6,7,4,4,4,6,10,5,2,2,1,1,4,1,1,1,1,1,10,10,8,5,1,2,2,2,3,2,1,2,1,0,1,1,,,,1,1,1,1,2,1,8,1,1,8,1,1,1,,3,1,0,1,1,1,1,1,7,3,7,1,1,1,1,4,20,1,0,99,,1,2,4,1,0,2,,,4,4,1,0,0,0,0,0,0,0,0,0,0,0,9,1,4,,2,99,1,1,,61
22,50,2201,7,5,56,314,314,2,5,0,0,0,1,12,9,2,3,1,13,14,1,2,4,4,4,4,1,4,1,2,2,2,3,,2,,,,,2,3,4,4,4,4,3,2,,2,2,2,4,,2,1,,,1,1,1,1,1,2,,,,,1,2,1,1,2,1,3,3,1,1,1,2,1,1,7,1,4,1,1,2,1,1,4,4,2,3,3,2,4,1,2,2,4,3,4,1,1,8,8,8,8,1,1,1,5,1,1,1,1,1,5,8,5,5,1,2,2,2,3,2,1,2,1,0,1,1,,,,,1,1,1,1,1,8,8,1,8,1,1,1,,1,1,1,1,1,3,5,1,1,7,7,1,1,1,1,6,22,1,0,99,,4,1,4,1,0,1,6,,4,4,1,0,0,0,0,0,0,0,0,0,0,0,4,1,4,,2,99,1,1,,67
22,51,2201,7,5,56,314,314,2,5,0,0,0,1,12,9,1,4,3,27,1,,1,4,4,4,4,2,4,2,2,2,2,3,,2,,,,,4,4,4,4,4,3,3,1,,2,3,2,4,,2,1,1,1,2,2,2,2,2,2,,,,,1,3,1,1,2,1,2,2,2,1,1,2,2,7,7,2,5,7,2,2,2,2,7,4,2,2,2,2,1,1,4,2,4,5,3,3,3,7,7,5,2,1,1,2,10,1,1,1,1,1,8,8,8,8,,2,2,2,4,2,1,2,1,1,1,,,,,,0,1,1,2,1,8,8,1,8,1,1,2,,3,1,2,1,2,1,1,2,7,7,7,1,1,1,1,7,30,1,,99,,4,2,3,1,1,1,3,,4,4,1,0,0,0,1,0,0,0,0,0,0,0,5,1,4,,2,99,1,1,,80
22,52,2201,7,5,56,314,314,2,5,0,0,0,1,12,9,2,4,1,19,20,20,3,4,4,4,4,1,4,2,2,2,2,3,,2,,,,,4,4,4,4,4,4,1,1,,2,2,2,3,2,4,1,,,1,1,1,1,1,2,,,,,1,3,1,1,2,1,4,3,3,3,3,3,2,4,5,2,5,5,5,4,2,2,4,3,1,1,1,1,1,1,1,4,4,5,3,1,1,10,10,10,5,3,1,1,5,1,1,1,1,1,10,10,10,10,1,2,2,2,3,2,1,2,1,0,0,1,,,,1,0,0,0,2,1,8,8,1,8,1,1,1,,2,1,1,1,1,3,2,1,1,7,7,1,1,1,1,4,42,1,0,99,,3,1,3,1,1,1,3,,4,4,1,0,0,0,0,0,0,0,0,0,0,0,9,2,,,,,1,1,,70
22,53,2201,7,5,56,314,314,2,5,0,0,0,1,13,9,1,3,6,10,0,6,1,4,4,4,4,2,4,2,2,2,2,2,2,2,,,,,4,4,1,4,4,4,4,3,,2,3,2,5,5,2,1,1,1,1,1,1,1,1,2,,,,,2,2,1,1,2,1,4,2,2,2,2,3,2,4,5,1,5,5,1,1,1,1,1,1,1,2,2,1,2,1,3,3,4,5,5,3,3,6,10,7,1,1,1,1,10,1,1,1,1,1,10,10,6,6,,2,2,2,4,2,1,2,1,0,0,1,,1,,,0,1,1,1,1,8,8,1,8,1,1,1,,1,1,1,1,1,1,1,3,4,1,7,1,1,1,1,3,36,1,,99,,4,1,4,3,2,1,6,,4,4,1,0,0,0,1,0,0,0,0,0,0,0,9,1,4,,2,99,1,2,1,58
22,54,2201,7,5,56,314,314,2,5,0,0,0,1,13,9,2,3,6,17,20,17,1,4,4,4,4,3,4,3,2,2,2,2,2,2,,,,,4,4,2,4,4,4,4,2,,2,3,2,4,5,2,1,2,2,1,1,1,1,1,2,,,,,2,3,3,1,2,1,1,1,1,1,1,1,1,3,4,1,1,4,1,1,1,1,7,4,1,1,1,1,1,1,1,2,6,7,4,2,2,7,7,7,3,1,1,1,5,2,1,1,1,1,10,10,10,10,,3,2,2,4,2,1,2,1,1,1,1,,,,,0,1,1,1,1,1,8,1,8,1,1,4,,2,1,5,1,5,1,1,3,1,5,5,1,1,1,1,7,40,1,,99,,4,2,4,3,3,2,6,1,4,4,1,0,0,0,0,0,0,0,0,0,0,0,4,1,4,,2,99,1,1,,75
22,55,2201,7,5,56,314,314,2,5,0,0,0,1,13,9,1,1,3,10,0,3,1,3,4,4,3,3,3,3,2,2,2,3,,2,,,,,2,4,4,4,4,4,2,3,,2,4,2,4,,,1,2,2,1,1,1,1,1,2,,,,,1,3,3,2,,,,7,1,1,1,1,2,2,5,1,1,1,1,1,1,7,7,1,1,2,1,6,2,1,7,2,5,7,5,4,,7,9,7,7,1,1,1,9,1,1,1,1,1,6,10,7,7,1,2,2,2,1,2,1,1,1,0,0,0,,,,,0,1,1,3,1,2,1,1,9,1,1,1,,3,1,1,1,1,3,4,3,1,5,4,1,1,1,1,11,43,2,,99,,1,2,4,2,2,1,7,,4,4,1,0,0,0,0,0,0,0,0,0,0,0,9,1,4,,2,99,1,1,,60
22,56,2201,7,5,56,314,314,2,5,0,0,0,1,13,9,2,3,1,6,27,6,3,4,4,4,4,2,4,2,2,2,2,3,,2,,,,,2,4,4,4,4,4,2,2,,2,3,2,4,,4,,1,1,1,1,1,1,1,2,,,,,1,3,1,2,2,1,3,1,1,1,1,2,1,4,5,1,1,1,1,1,1,1,5,3,1,1,1,1,1,1,4,3,4,7,4,2,2,7,10,7,7,1,1,1,10,1,1,1,1,1,6,10,6,6,1,2,2,2,3,2,1,2,1,0,1,0,,,,,0,1,1,2,1,2,8,1,8,1,1,1,,3,1,1,1,1,3,4,3,1,5,5,1,1,1,1,5,56,1,0,99,,4,2,4,2,3,1,4,,4,4,1,0,0,0,0,0,0,0,0,0,0,0,4,2,,,,,1,1,,75