PAIS,IDNUM,RI,ESTRATOPRI,UPM,GUYREGION,GUYMUNICIPALITY,CLUSTER,UR,SIZE,GUYDIOMA,DAY,MONTH,Q1,A4,DEM13A,DEM13B,DEM13C,DEM13D,A1,A2,A3,A4I,SOCT1,SOCT2,IDIO1,IDIO2,CP2,CP4A,CP4,PROT1,PROT2,CP5,CP5A,CP5B,CP5C,CP5D,CP6,CP7,CP8,CP9,CP10,CP13,LS3,IT1,L1,NP1,NP1B,NP2,SGL1,SGL2,LGL2,LGL3,MUNI2,MUNI3,MUNI5,MUNI6,MUNI8,MUNI9,MUNI10,MUNI11,MUNI15,JC1,JC4,JC10,JC12,JC13,JC15,JC16,POP1,POP2,POP3,POP4,POP5,VIC1,VIC2,AOJ1,AOJ1B,AOJ8,AOJ11,AOJ11A,AOJ12,AOJ16A,AOJ17,AOJ18,ST1,ST2,ST3,GUYST4A,ST4,B1,B2,B3,B4,B6,B10A,B11,B12,B13,B14,B15,B18,B20,B21,B31,B32,B43,B33,B37,B40,B42,B46,B47,N1,N3,N9,N10,N11,N12,M1,ING4,PN2,DEM23,PN4,PN5,E5,E8,E11,E15,E14,E2,E3,E16,D32,D33,D34,D36,D37,D1,D2,D3,D4,D5,DEM2,DEM11,AUT1,PP1,PP2,DC1,DC10,DC13,EXC2,EXC6,EXC11,EXC13,EXC14,EXC15,EXC16,EXC17,EXC18,EXC19,EXC7,GI1,GI2,GI3,GI4,GI5,VB1,VB2,GUYVB3,VB4,VB8,VB6,GUYVB7,VB10,GUYVB11,POL1,POL2,AA1,AA2,AA3,AA4,DIS2,DIS3,DIS4,DIS5,ED,Q2,Q3,Q10,Q10A,Q10B,Q10C,Q14,Q10D,Q11,Q12,GUYETID,GUYETIDA,GUYLENG1,R1,R3,R4,R4A,R5,R6,R7,R8,R12,R14,R15,OCUP1,OCUP4,OCUP1A,OCUP1B1,OCUP1C,DESOC2,MIG1,MIG2,MIG3,TI
24,95,4,2401,4204,4,2,4204,1,1,1,29,10,1,56,23,26,,26,3,1,1,4,5,3,5,2,2,2,2,1,1,2,,,,,4,4,4,4,4,3,4,2,,1,3,2,4,,1,2,2,2,0,2,0,,,4,1,2,1,1,2,1,2,1,2,2,2,2,2,2,,,,1,2,2,4,2,4,2,3,9,9,9,9,3,4,1,1,1,1,1,5,3,1,1,1,1,2,3,3,3,3,4,,3,1,1,1,1,1,1,1,1,5,4,,7,4,4,10,10,6,9,4,5,8,10,1,1,1,1,1,9,9,9,9,1,2,2,2,4,2,1,2,1,0,0,,,,,,0,1,1,1,1,1,1,1,1,1,1,2,,3,2,,2,,1,3,4,4,1,7,1,1,2,2,11,45,4,4,2,1,1,1,3,1,1,4,4,1,1,1,1,1,0,0,0,0,1,1,0,9,2,,,,52,3,1,,36
24,148,4,2401,4212,4,2,4212,1,1,1,2,11,1,3,24,3,,3,2,1,2,4,4,3,4,3,2,2,2,1,1,2,,,,,2,4,4,4,4,3,3,2,5,2,,2,,,,,4,3,0,1,0,,,,,1,1,1,,1,,2,2,2,,2,2,2,,,,2,2,1,3,1,4,2,9,9,9,9,9,,5,4,4,,4,3,5,4,3,,4,7,4,3,5,7,,6,7,4,,5,3,3,3,3,3,3,,,7,1,3,3,10,10,10,1,1,1,,1,2,2,,,,10,10,10,10,,2,,2,3,2,1,2,2,0,0,,,,,0,1,1,1,2,1,8,1,2,8,1,1,3,,3,1,3,2,,3,4,3,5,4,4,2,2,2,2,11,29,2,,,,4,2,,3,1,4,4,1,1,1,1,0,0,0,0,0,1,1,0,,2,,,,52,2,1,,30
24,276,4,2401,4107,4,1,4107,1,1,1,1,11,1,59,17,15,0,17,2,1,1,4,4,3,4,3,2,1,2,1,1,2,,,,,1,2,4,4,4,2,3,,2,2,2,2,3,4,1,2,1,4,0,0,0,,,3,1,2,2,2,2,,2,2,2,2,2,2,2,1,1,2,4,2,1,1,3,2,4,1,,2,9,9,1,3,3,2,2,1,4,4,3,3,3,2,4,7,6,3,5,4,3,4,7,3,1,3,2,2,1,3,1,2,4,7,4,7,4,3,10,10,2,5,1,2,1,1,1,1,5,1,1,10,10,10,10,10,2,2,2,2,2,1,2,3,1,0,1,1,0,1,1,0,1,1,2,1,1,1,1,1,1,1,3,,1,1,3,2,,2,2,1,4,1,1,1,,2,1,11,45,3,7,2,3,1,2,2,2,4,3,3,1,1,1,1,1,1,1,1,0,0,1,0,4,1,2,4,1,,3,1,,46
24,402,4,2402,3801,3,8,3801,2,5,1,2,11,2,5,13,18,,,1,1,2,4,3,2,2,1,2,1,2,1,1,1,1,1,1,1,2,2,2,2,4,4,1,2,,1,2,1,2,2,2,1,,4,0,1,1,2,1,2,2,1,1,1,1,1,2,2,2,2,2,2,1,2,,,,2,1,1,1,2,4,2,9,9,9,9,9,4,7,5,4,7,4,4,4,4,4,4,4,7,4,4,4,7,4,4,7,7,4,1,1,4,1,1,1,1,3,7,7,7,2,2,7,10,5,3,1,1,1,10,10,1,1,10,1,10,10,10,10,1,3,2,1,4,2,1,2,2,0,0,,0,,0,0,0,0,0,3,1,8,1,1,8,1,1,1,,1,2,,2,,4,5,1,7,1,7,2,2,2,2,11,39,3,3,3,2,1,2,2,2,3,5,5,1,1,0,0,1,0,0,0,0,1,0,0,9,1,1,1,1,,1,1,,80
24,421,4,2402,3813,3,8,3813,2,5,1,3,11,1,,,,,,2,2,2,2,3,1,3,1,2,2,2,1,1,1,1,1,1,1,1,4,3,3,4,4,1,1,8,2,,,,,,1,11,3,0,2,0,,,4,,1,,1,2,2,2,2,2,2,2,,,2,,,,1,3,1,2,2,4,,3,3,4,9,4,5,4,3,4,5,5,1,2,3,,,2,7,3,5,4,7,4,,5,5,4,1,3,5,6,,6,1,3,,7,,3,,9,10,5,1,2,5,5,5,5,5,4,10,5,7,10,5,5,1,,2,2,4,2,1,2,1,0,0,,0,,,,0,0,0,1,1,8,1,1,8,1,1,2,,3,1,2,2,,4,5,1,2,3,7,2,2,2,2,10,23,3,4,,,4,1,2,1,0,4,4,,1,0,0,0,0,0,0,0,1,0,0,9,1,4,3,2,,1,1,,50
24,426,4,2402,3813,3,8,3813,2,5,1,3,11,2,25,26,1,22,22,1,4,3,4,3,2,3,3,2,2,2,1,1,1,1,1,1,2,1,3,2,2,4,4,2,2,6,2,3,1,4,4,2,2,11,4,0,0,0,,,4,0,1,1,1,1,1,2,2,2,2,2,2,2,2,,,,1,3,1,2,2,2,2,9,9,9,9,9,6,6,4,4,3,5,6,6,6,6,6,6,7,6,6,4,5,5,6,6,7,6,5,5,4,5,5,4,1,3,5,7,7,3,2,8,8,8,1,5,4,3,1,1,1,6,4,4,10,10,,10,1,2,2,2,4,2,1,1,3,0,0,,0,,0,0,0,0,0,2,1,1,1,1,8,1,2,,2,,2,,2,,4,5,1,1,2,7,2,2,2,2,13,31,2,4,,,4,1,4,1,3,4,4,,0,0,0,1,0,0,0,0,0,0,0,1,1,1,1,1,,1,1,,40
24,465,5,2403,2805,2,8,2805,2,5,1,4,11,2,59,7,12,16,,1,1,2,3,3,,3,,1,1,1,1,1,1,1,1,1,1,2,2,2,3,4,4,3,2,,2,3,,,,,2,10,,,,,,,,,2,2,,2,2,2,2,2,2,2,2,2,2,,,,1,1,3,,,,,9,9,9,9,9,5,5,5,5,5,5,5,6,4,4,4,4,7,3,3,3,7,3,7,,,,,,4,4,5,6,,,4,5,5,3,3,5,6,4,5,4,3,3,1,5,6,5,4,4,6,8,8,9,1,2,2,2,,2,1,3,2,0,0,,,,,,0,0,1,2,1,1,1,1,1,1,2,,3,,2,,,,4,5,1,3,5,3,,,,,3,66,6,0,3,2,2,2,3,6,4,6,6,,1,1,1,0,0,0,0,0,1,1,0,14,,,,,,1,1,,30
24,524,5,2403,2301,2,3,2301,1,4,1,4,11,1,5,28,,0,,2,1,3,4,3,3,4,3,2,2,2,1,1,1,1,1,1,2,2,4,2,4,4,3,4,4,,2,3,2,3,3,2,2,10,4,0,0,0,,,3,1,1,2,1,1,1,2,1,2,2,1,2,1,2,,,,2,4,1,4,1,2,2,9,9,9,9,9,1,1,1,1,3,1,3,3,1,1,1,1,7,1,2,1,7,1,1,1,1,1,1,1,1,1,7,1,1,5,1,7,1,4,4,10,10,10,10,1,10,10,10,1,1,1,5,1,10,10,10,10,1,2,2,1,4,2,1,3,3,1,0,,0,,,,0,1,0,1,1,8,1,1,8,1,1,,,,2,,2,,4,4,1,1,1,1,1,1,1,2,11,27,7,3,,,4,1,4,2,1,6,6,1,1,1,1,1,1,0,1,1,1,1,0,4,1,4,1,,,2,1,,52
24,543,4,2402,3805,3,8,3805,2,5,1,30,10,2,3,3,,0,,1,1,1,4,5,3,4,3,2,2,2,1,1,1,2,1,1,1,1,2,3,4,4,2,3,2,,1,3,1,5,5,2,2,10,4,0,0,0,,,4,1,1,1,1,2,1,2,2,2,2,2,1,2,2,,,,,4,1,1,1,1,1,1,1,1,1,2,7,,1,1,2,7,,7,,,,7,7,1,7,5,7,6,4,,7,1,1,1,1,1,1,1,2,4,5,4,3,3,4,6,10,3,1,1,1,1,2,6,5,1,1,1,2,3,4,1,1,1,2,2,4,2,1,2,2,0,0,,,,,,0,0,0,1,1,2,1,1,8,1,1,2,,3,2,,1,2,3,3,1,3,3,3,2,2,2,2,10,20,2,0,,,4,1,4,1,1,4,5,1,0,0,1,0,0,0,0,0,1,0,0,13,,,,,,1,1,,80
24,545,4,2402,3805,3,8,3805,2,5,1,30,10,1,4,11,0,0,,3,1,2,4,5,3,4,3,2,2,2,1,1,1,2,1,1,2,3,4,4,4,4,1,2,2,,2,2,1,4,3,2,1,5,4,0,0,0,,,4,2,1,1,1,2,2,2,2,2,2,2,2,2,2,,,,1,1,1,4,1,4,2,3,4,4,2,3,4,4,1,1,2,3,1,7,3,3,3,3,6,1,3,2,7,2,1,,3,1,2,3,3,2,3,1,2,3,6,7,7,2,3,8,10,6,7,1,1,1,1,4,8,4,4,1,7,7,3,3,1,1,2,2,2,2,1,2,1,1,0,0,,,,,0,0,0,1,1,8,1,1,8,1,1,2,,3,2,,1,2,1,2,1,1,2,7,2,2,2,2,6,49,7,5,,,4,2,2,1,4,4,5,1,1,1,0,0,0,0,0,0,1,0,0,10,2,,,,3,1,1,,51
24,556,5,2402,3821,3,8,3821,2,5,1,29,10,2,11,,0,0,,3,1,2,4,3,3,3,2,2,1,1,1,1,1,2,1,1,1,2,2,2,4,4,3,3,2,10,1,2,1,4,3,2,2,6,4,0,0,1,3,0,4,2,2,1,2,2,1,2,2,2,2,2,2,2,2,,,,1,2,2,2,1,2,2,4,4,4,4,4,4,4,3,4,5,4,3,5,3,7,1,3,4,4,4,4,7,4,7,6,4,5,1,5,5,2,3,3,2,3,4,7,5,,2,8,8,6,3,2,1,1,1,3,4,4,4,5,7,7,5,5,4,,2,1,3,1,1,2,3,0,0,,,,0,0,0,0,,2,1,8,1,1,1,1,1,0,,,1,0,,0,4,5,1,4,1,4,2,2,2,2,12,45,1,2,,,4,2,,3,4,5,4,2,1,1,0,1,0,1,1,0,1,1,1,4,1,4,1,1,,2,1,,32
24,557,4,2402,3821,3,8,3821,2,5,1,30,10,2,5,29,4,13,29,3,1,2,,4,3,4,2,2,1,2,1,1,1,2,1,1,2,1,,3,4,4,4,2,1,,1,3,1,4,4,3,2,2,4,0,0,0,,,4,0,2,2,2,2,1,2,2,2,2,2,2,2,2,,,,1,1,,1,1,4,2,3,9,9,9,3,3,,3,2,2,1,1,7,1,1,,1,7,2,2,2,7,,3,1,1,1,1,1,1,1,1,1,1,4,7,7,1,3,3,10,10,10,10,1,1,1,10,1,1,1,1,1,10,10,10,10,10,3,2,2,1,2,1,1,1,0,0,0,,,0,0,0,0,0,2,1,1,1,1,1,1,1,2,,1,1,6,2,,4,3,1,1,1,7,2,,2,2,8,60,2,2,,,4,1,3,6,3,4,4,1,1,1,1,0,0,1,0,0,0,1,0,14,,,,,,1,1,,60
24,572,4,2402,3807,3,8,3807,2,5,1,30,10,1,5,0,0,0,,1,1,1,4,5,3,2,3,2,1,2,1,1,1,2,1,1,1,2,3,2,4,3,3,3,3,,1,3,1,5,5,2,2,11,4,0,3,0,,,1,0,2,1,1,1,1,1,1,2,2,2,1,2,2,,,,2,4,1,1,1,1,2,4,4,4,4,4,1,1,1,1,1,1,1,1,1,1,1,1,7,1,1,1,1,1,1,1,1,1,1,1,1,1,1,1,1,5,7,7,7,4,4,10,10,1,1,1,1,1,10,1,1,1,1,1,10,10,1,10,1,2,1,2,4,2,1,2,1,1,1,0,,,1,1,1,0,1,1,1,9,1,1,8,1,1,6,,3,2,,2,,1,1,1,2,1,7,1,1,1,1,7,37,6,3,,,4,2,3,2,2,6,6,1,1,1,0,1,0,0,0,0,0,0,0,10,1,4,2,2,,1,1,,80
24,604,6,2402,3814,3,8,3814,2,5,1,28,10,1,3,17,,0,,3,2,2,4,4,3,4,3,2,2,2,1,1,2,,,,,3,4,4,4,4,3,4,2,3,2,3,,4,,,2,1,3,0,0,0,,,4,,1,1,1,2,1,,,2,2,1,2,,2,,,,2,1,3,3,1,4,2,4,3,9,9,4,4,4,4,4,4,4,4,5,5,4,4,4,5,5,4,4,4,4,5,6,4,4,4,2,2,2,2,1,1,4,5,6,6,4,3,10,10,9,9,1,10,10,10,1,1,1,1,1,10,10,10,10,1,3,2,1,1,1,1,3,1,0,0,,,,0,,0,1,1,1,1,2,1,2,2,1,1,2,,2,1,2,1,2,1,3,7,4,1,7,2,2,2,2,11,22,3,3,,,3,1,3,1,0,4,4,1,1,1,0,1,0,0,0,0,1,0,0,,2,,,,,1,1,,34
24,625,3,2402,3806,3,8,3806,2,5,1,28,10,2,1,13,7,18,7,1,1,4,4,2,1,1,1,2,2,2,1,1,1,1,1,1,1,1,1,2,2,2,2,1,2,7,1,3,2,1,1,1,1,77,1,0,3,0,,,2,3,2,2,2,2,2,1,1,2,2,2,1,2,2,,,,2,4,3,2,2,1,2,1,2,1,2,1,3,4,4,3,5,4,6,5,4,5,3,2,7,4,5,4,7,3,3,3,2,2,4,7,6,5,4,3,2,1,5,6,3,1,1,1,5,6,7,3,4,9,4,2,10,6,7,10,10,9,2,7,5,2,2,2,1,1,1,2,1,1,0,0,1,0,0,0,0,0,0,4,1,8,8,8,8,1,1,1,,1,1,1,1,1,3,4,4,5,6,7,1,1,1,2,11,42,6,3,,,4,2,2,2,2,6,6,1,1,0,0,0,0,0,0,0,0,0,0,3,1,2,3,1,,1,1,,85
24,673,4,2402,4801,4,8,4801,2,5,1,1,11,1,1,3,27,0,3,1,1,1,4,3,3,3,3,2,2,2,1,1,2,,,,,3,2,4,,,,3,2,6,1,2,2,1,1,2,1,6,2,0,3,1,2,1,,3,2,2,1,2,2,2,2,2,2,2,1,2,2,,,,1,1,1,1,1,3,1,1,1,1,1,1,5,5,5,5,5,4,5,6,6,6,5,6,6,5,6,5,5,4,4,5,5,5,5,2,5,4,3,2,,4,7,7,3,2,2,10,10,9,2,4,2,2,2,4,9,10,4,5,10,9,10,9,1,3,2,2,1,1,1,1,1,0,0,,0,,0,0,0,1,1,2,1,1,1,1,1,1,1,1,,3,1,6,2,,3,4,1,1,1,1,2,2,2,1,,32,7,7,4,2,2,2,3,2,4,5,4,1,1,1,1,1,1,1,1,0,1,1,1,2,1,1,3,1,,1,2,,35
24,697,3,2402,4804,4,8,4804,2,5,1,31,10,1,58,2,0,0,,3,2,3,3,4,2,4,2,1,2,1,1,1,1,2,,2,1,3,4,3,4,3,3,3,1,5,,2,2,3,3,3,2,3,4,1,1,1,1,1,2,1,1,2,,2,2,1,1,2,,2,1,2,1,7,2,4,1,4,3,2,2,3,1,1,9,9,4,3,2,3,3,3,4,4,5,5,4,5,,4,5,4,4,4,4,4,4,7,,,4,4,4,4,3,3,3,3,6,6,6,3,3,7,7,7,1,1,1,1,3,2,2,2,2,2,8,8,8,8,8,2,2,2,3,2,1,2,2,0,0,,,,,,0,1,1,1,1,1,1,1,2,1,1,6,,3,1,3,1,3,1,2,2,1,2,7,1,1,1,1,8,24,4,4,4,1,2,1,2,1,0,3,3,1,1,1,1,1,0,0,0,0,0,1,0,2,1,2,2,2,,1,2,1,30
24,775,4,2402,3816,3,8,3816,2,5,1,30,10,1,14,,0,0,,1,3,3,1,4,3,4,3,2,2,2,1,1,1,1,1,1,1,1,3,2,2,4,3,3,3,10,1,2,2,5,5,,,1,4,0,2,0,,,2,2,1,1,1,1,1,1,1,1,2,2,2,2,1,1,2,1,1,4,1,3,1,1,2,3,3,3,2,2,1,3,5,7,7,3,7,7,7,7,1,1,1,1,1,,7,3,6,3,3,7,7,3,6,6,7,7,7,2,6,7,7,2,2,10,10,10,1,10,10,1,10,10,10,10,10,10,1,1,10,1,1,3,2,2,4,2,2,2,2,0,0,0,1,0,1,0,0,0,1,1,8,8,1,2,8,2,1,0,,,2,,2,,2,2,1,1,7,7,1,,1,1,9,18,2,,,,,,2,1,0,4,6,1,1,0,0,0,2,0,0,0,0,0,0,10,1,2,2,2,,1,1,,40
24,802,4,2402,3815,3,8,3815,2,5,1,28,10,2,1,13,,0,,2,1,1,3,5,3,5,3,2,1,1,1,1,1,1,1,1,1,3,2,2,,2,3,4,2,9,1,2,1,4,3,4,1,4,3,0,2,0,,,3,2,2,2,1,2,1,2,2,,,,1,1,1,1,2,1,2,3,1,3,2,3,2,9,9,9,3,9,3,1,1,1,2,2,1,5,2,2,3,1,4,1,2,3,3,3,5,4,2,1,1,1,1,1,1,2,1,4,6,4,1,4,3,8,10,5,1,3,1,1,3,1,1,9,9,1,10,10,8,8,1,2,2,2,3,2,1,2,1,0,0,,,,,,1,0,0,1,1,2,1,1,2,1,1,3,,3,1,3,2,3,2,3,1,3,1,7,1,1,2,1,,32,,3,,,4,1,3,2,2,6,6,1,1,1,0,1,0,0,0,0,1,0,0,10,1,2,5,1,,1,1,,35
24,805,6,2402,3815,3,8,3815,2,5,1,28,10,1,13,29,17,15,29,3,2,2,2,3,2,3,2,2,2,2,1,1,1,1,1,1,2,3,3,3,4,4,3,2,3,,2,2,1,2,2,2,1,1,2,0,,1,2,1,3,2,2,2,2,,,2,,2,2,2,1,2,2,,,,2,1,1,2,2,4,2,2,2,2,2,2,5,6,6,6,5,5,5,5,5,5,4,4,6,6,5,5,7,5,6,7,4,5,6,4,4,4,6,3,3,2,5,5,5,2,2,10,10,10,1,1,1,1,4,1,1,1,1,1,10,10,10,10,1,2,2,2,,2,1,1,1,0,0,0,0,,0,0,1,1,1,1,1,1,1,1,1,1,2,,3,,2,,2,,3,4,1,1,1,7,2,1,2,2,13,25,3,3,,,1,1,2,5,2,5,6,1,1,1,0,1,0,0,0,1,1,1,1,2,1,2,3,1,,1,1,,35
24,807,6,2402,3815,3,8,3815,2,5,1,28,10,1,5,17,18,10,18,3,1,1,4,5,2,4,2,2,2,2,1,1,2,,,,,1,3,4,4,3,3,2,2,,2,,2,3,3,4,,1,3,0,0,0,,,3,2,2,2,2,2,2,,2,2,,,2,,1,2,2,3,1,1,1,2,2,3,2,3,3,3,3,3,4,4,4,4,4,4,4,5,4,4,4,4,4,4,4,3,7,4,4,4,4,4,4,3,3,2,4,2,1,4,7,6,4,3,3,10,10,10,9,5,5,5,8,1,1,1,3,1,10,10,10,10,8,,1,1,1,1,1,3,1,0,0,,0,,,,0,1,1,1,1,1,1,1,1,1,1,3,,1,1,3,2,,3,3,1,1,1,1,2,2,2,2,15,42,2,5,,,2,1,3,1,2,4,4,1,1,1,1,1,1,1,1,0,1,1,1,1,1,1,4,1,,1,1,,35
24,809,6,2402,3815,3,8,3815,2,5,1,28,10,1,15,27,,0,,2,1,3,4,4,3,4,3,2,2,2,1,1,2,,,,,3,4,4,4,4,3,4,2,4,2,2,2,3,3,,2,1,3,0,,0,,,4,1,2,1,1,2,2,2,2,2,,,2,,2,,,,1,1,2,2,2,4,2,4,3,9,3,3,5,5,5,5,5,5,4,5,4,4,4,4,7,6,5,5,7,5,5,7,4,5,4,2,3,4,6,4,4,3,6,6,6,3,2,10,10,10,10,5,5,1,10,1,1,1,1,1,10,10,8,9,5,3,1,1,2,2,1,2,2,0,0,,0,,0,,0,1,1,2,1,2,1,1,2,1,1,2,,2,1,2,1,2,2,3,1,5,1,7,2,2,2,2,11,53,3,3,,,4,2,3,3,6,4,4,1,1,1,0,0,0,0,0,0,1,0,0,5,1,2,1,2,,1,1,,35
24,812,4,2402,3808,3,8,3808,2,5,1,30,10,1,55,4,10,24,,1,1,1,4,5,3,2,3,2,1,2,1,1,1,2,1,1,1,2,3,2,4,3,3,3,3,,1,3,1,5,5,2,2,11,4,0,3,0,,,1,0,2,1,1,1,1,1,1,2,2,2,2,2,2,,,,2,4,1,1,1,1,2,4,4,4,4,4,1,1,1,1,1,1,1,1,1,1,1,1,7,1,1,1,1,1,1,1,1,1,1,1,1,1,1,1,1,5,7,7,7,4,4,10,10,1,1,1,1,1,10,1,1,1,1,1,10,10,1,10,1,2,1,2,4,2,1,2,1,1,1,0,,,1,1,1,0,1,1,1,9,1,1,8,1,1,6,,3,2,,2,,1,1,1,2,1,4,1,1,1,1,7,39,6,3,,,,2,3,2,5,6,6,1,1,1,0,1,0,0,0,0,0,0,0,10,1,4,2,2,,1,1,,65
24,817,3,2402,3808,3,8,3808,2,5,1,29,10,1,16,7,13,,13,2,2,1,3,4,3,4,2,1,2,2,1,1,1,1,1,1,1,2,3,3,4,4,3,3,2,7,1,2,1,4,3,,2,2,3,1,1,1,3,0,4,1,2,2,1,2,1,1,1,2,2,2,2,2,1,7,1,,1,4,1,3,1,4,2,3,2,3,3,4,4,4,3,3,3,3,5,4,3,3,3,1,5,4,4,4,4,3,4,2,4,4,3,4,4,3,4,3,3,2,6,7,1,3,2,6,10,6,1,1,1,2,1,5,2,4,10,6,3,5,8,4,1,3,2,2,2,2,1,,,1,1,0,1,0,0,0,0,1,1,,1,1,1,8,8,1,1,3,,1,2,,2,,4,3,1,2,1,5,1,1,1,1,13,50,5,5,,,4,2,2,2,7,3,6,1,0,0,0,1,0,0,0,0,1,0,0,10,1,1,4,1,,1,2,1,85
24,830,4,2403,5807,5,8,5807,2,5,1,29,10,1,5,11,6,,6,1,3,2,4,3,2,3,2,2,2,2,1,1,1,1,2,1,1,2,4,3,4,4,3,1,4,,1,1,2,2,2,1,,5,1,,3,1,1,1,4,2,2,2,1,1,2,2,2,2,2,2,1,2,2,,,,1,1,1,4,2,4,2,1,3,9,1,1,2,5,4,6,7,3,7,7,6,7,5,4,6,4,4,6,7,6,4,5,3,4,7,4,6,4,6,5,4,2,6,4,2,2,2,2,9,8,1,1,1,1,2,8,3,4,6,5,1,4,3,4,3,2,2,1,2,2,1,1,2,0,0,,1,,0,,0,1,1,1,1,1,1,1,2,1,1,1,,2,1,1,2,,4,4,2,7,4,7,2,2,1,2,8,42,2,3,2,3,2,2,2,2,2,6,6,1,0,0,1,1,0,0,0,0,0,1,0,11,1,2,3,1,,1,1,,40
24,836,4,2403,5808,5,8,5808,2,5,1,29,10,1,13,6,15,14,6,2,2,2,4,2,3,2,3,2,2,2,1,1,1,2,1,1,1,1,2,4,4,4,4,3,2,,2,2,2,2,2,4,,3,4,1,1,0,,,3,2,2,2,,2,1,1,2,,,2,1,1,2,,,,2,2,1,2,2,4,,3,2,3,3,3,4,4,4,3,2,6,2,6,4,4,4,3,7,3,4,4,6,4,4,4,6,6,3,6,6,6,6,4,4,3,5,5,5,3,2,7,7,7,6,8,1,1,6,2,2,3,4,4,4,5,4,4,7,3,1,2,3,2,1,2,2,0,0,,0,,,0,0,0,1,,1,8,1,2,1,1,1,2,,2,1,2,2,,3,,5,5,4,4,1,2,2,2,4,33,7,3,,,4,2,1,2,4,6,6,1,0,0,1,1,0,0,0,0,0,1,0,7,1,3,1,1,,3,1,,35
24,842,4,2403,5808,5,8,5808,2,5,1,29,10,2,12,6,15,0,15,2,1,2,4,3,3,3,3,2,2,2,1,1,2,,,,,2,3,2,2,2,3,3,3,3,,1,1,1,1,,1,,1,1,1,0,,,3,2,1,1,1,1,1,1,1,1,1,1,2,2,1,2,1,,2,2,2,2,2,2,2,3,2,2,2,2,7,6,7,7,6,6,6,7,6,7,7,5,5,6,6,7,7,7,4,4,,7,7,7,7,7,7,7,7,1,5,4,4,1,2,2,2,4,4,1,1,4,6,2,2,2,4,4,2,1,2,2,1,2,2,2,1,1,1,2,2,0,0,0,,,,0,1,0,0,3,1,8,1,2,8,1,1,,,2,1,,1,,3,2,3,4,4,2,2,2,2,2,10,30,6,5,,,4,2,1,3,2,6,6,1,1,1,1,1,0,1,0,1,1,1,1,5,1,4,2,1,,1,1,,36
24,931,5,2403,6809,6,8,6809,2,5,1,2,11,1,70,29,13,,13,3,1,1,4,4,2,2,2,2,2,2,1,1,2,,,,,1,2,4,4,4,4,2,2,5,2,2,2,3,3,1,2,1,3,0,1,0,,,2,2,2,1,2,2,2,2,2,2,2,2,,2,2,,,,2,3,1,4,2,4,1,4,2,2,3,3,4,3,2,3,4,4,3,5,5,4,3,6,7,3,5,3,7,4,4,,4,,3,3,4,4,4,5,3,3,4,7,4,2,2,4,7,4,1,1,1,1,5,5,4,,3,,5,4,4,5,1,2,2,,4,2,1,2,2,0,0,,0,,,0,0,1,1,2,1,8,1,1,8,1,1,1,,1,2,,1,1,3,5,1,4,3,6,2,2,2,2,9,36,2,3,2,1,2,2,2,4,6,6,1,1,1,1,1,0,0,0,0,0,0,1,0,9,1,1,1,1,,1,1,,35
24,977,4,2403,5804,5,8,5804,2,5,1,29,10,1,13,7,3,32,23,1,1,1,4,3,3,3,3,2,2,2,1,1,1,1,1,1,1,1,2,1,2,4,1,1,3,,1,3,1,4,5,1,1,4,2,0,0,0,,,2,0,1,2,1,2,1,2,2,2,2,2,2,2,2,,,,1,2,2,3,2,3,2,3,3,3,2,4,,3,3,4,5,3,5,7,6,7,4,1,7,5,4,5,6,5,3,2,4,5,6,4,3,1,4,1,5,,5,5,5,2,2,10,10,8,1,3,5,1,1,1,1,3,5,7,3,7,5,5,1,2,2,2,4,1,1,2,2,0,0,,,0,1,,0,1,0,2,1,2,1,1,2,1,1,1,,2,1,1,1,1,3,3,5,4,6,5,2,2,2,2,16,37,,0,,,3,1,,1,0,6,6,1,0,0,0,1,0,0,0,0,0,0,0,12,,,,,,1,1,,30
24,979,4,2403,5804,5,8,5804,2,5,1,28,10,2,59,1,14,30,30,1,2,1,4,1,1,2,1,2,1,2,1,1,2,,,,,1,4,4,4,4,4,3,3,,2,3,,,3,,,10,4,0,0,0,,,4,1,2,2,2,2,2,2,2,2,2,2,2,2,2,,,,2,3,1,4,2,3,2,4,3,3,9,9,,1,1,1,1,1,1,4,,1,3,1,7,1,1,,7,,4,5,1,1,1,1,1,1,1,1,1,5,4,6,5,3,3,7,8,7,3,3,2,1,1,1,1,3,5,7,3,6,4,5,1,,2,,4,,1,3,3,0,0,,,0,0,,0,1,1,2,2,2,2,2,9,3,2,,6,,2,,2,,4,5,1,1,1,4,2,2,2,2,4,22,,0,,,,,,1,0,6,6,1,1,1,1,1,0,0,0,1,0,1,0,6,,5,,,,1,1,,55
24,988,4,2403,5805,5,8,5805,2,5,1,29,10,1,13,7,3,27,7,1,1,1,4,3,3,3,3,2,2,2,1,1,1,1,1,1,1,1,2,1,2,4,1,1,3,,1,3,1,4,5,1,1,4,2,0,0,0,,,2,0,1,2,1,2,1,2,2,2,2,2,2,2,2,,,,1,2,2,3,2,3,2,3,3,3,2,4,,3,3,4,5,3,5,7,6,7,4,1,7,5,4,5,6,5,3,2,4,5,6,4,3,1,4,1,5,3,5,5,5,2,2,10,10,8,1,3,5,1,1,1,1,3,5,7,3,7,5,5,1,2,2,2,4,1,1,2,2,0,0,,,0,1,,0,1,0,2,1,2,1,1,2,1,1,1,,2,1,1,1,1,3,3,5,4,6,5,2,2,2,2,5,19,6,0,,,3,1,,1,0,6,6,1,0,0,0,1,0,0,0,0,0,0,0,12,,,,,,1,1,,50
24,990,4,2403,5805,5,8,5805,2,5,1,28,10,1,13,7,3,27,3,1,1,1,4,3,3,3,3,2,2,2,1,1,1,1,1,1,1,1,2,1,2,4,1,1,3,,1,3,1,4,5,1,1,4,2,0,0,0,,,2,0,1,2,1,2,1,2,2,2,2,2,2,2,2,,,,1,2,2,3,2,3,2,3,3,3,2,4,,3,3,4,5,3,5,7,4,1,7,5,4,5,6,5,3,2,4,5,4,4,4,4,3,1,4,1,5,3,5,5,5,2,2,10,10,8,1,3,5,1,1,1,1,3,5,7,3,7,5,5,1,2,2,2,4,1,1,2,2,0,0,,,0,1,,0,1,0,2,1,2,1,1,2,1,1,1,,2,1,1,1,1,3,3,5,4,6,5,2,2,2,2,11,27,,0,,,3,1,,1,0,6,6,1,0,0,0,1,0,0,0,0,0,0,0,12,,,,,,1,1,,65
24,1094,4,2402,4829,4,8,4829,2,5,1,5,11,2,70,,0,0,,4,2,2,4,4,3,2,1,2,2,2,1,1,2,,,,,2,4,4,4,4,3,2,3,,2,3,2,5,,1,2,5,4,0,0,0,,,1,0,2,2,1,2,2,2,1,1,1,1,1,1,2,,,,1,3,2,3,1,3,1,2,9,9,9,4,4,3,5,3,5,4,4,5,6,3,7,6,7,2,1,3,7,5,4,6,5,4,3,1,4,4,4,5,1,5,,7,,,,5,5,5,3,3,3,1,1,5,4,7,7,7,5,5,5,5,1,1,2,1,2,2,1,3,2,0,0,,,,0,,0,1,1,2,1,8,1,8,2,1,1,2,,1,1,2,1,2,2,3,6,2,2,6,2,2,2,2,6,23,6,1,,,,1,1,1,1,4,4,1,1,1,1,0,0,0,0,0,0,1,0,11,2,,,,52,1,2,3,30
24,1101,4,2402,4829,4,8,4829,2,5,1,5,11,2,31,,0,0,,1,2,1,4,1,2,2,,2,2,2,1,1,2,,,,,1,4,2,2,4,4,1,3,,2,,2,,,2,2,2,4,0,1,0,,,3,1,2,1,2,,,2,2,2,2,2,1,1,2,,,,2,1,1,4,2,4,,1,1,2,2,1,5,5,6,7,7,5,1,4,5,4,3,5,6,4,3,5,7,3,5,4,3,3,1,5,6,1,6,6,4,1,4,5,4,1,,5,6,6,5,4,7,5,7,9,3,8,4,6,7,,,5,6,,2,1,3,2,3,2,2,0,0,,,,,,0,0,1,2,1,8,2,8,9,1,1,2,,1,1,2,2,,2,3,5,1,7,7,2,2,2,2,10,19,2,5,,,2,,3,1,0,4,4,1,1,1,1,0,0,0,0,0,1,1,0,11,2,,,,52,1,1,,50
24,1158,5,2403,5802,5,8,5802,2,5,1,29,10,1,11,18,,0,,2,1,2,,5,3,5,3,1,1,1,1,1,1,1,1,1,1,3,3,3,3,3,3,1,2,,1,2,1,2,2,1,1,4,2,1,2,1,2,1,2,2,1,2,2,2,1,2,2,2,2,2,2,2,2,,,,1,,,,,,,3,2,2,3,4,4,5,4,2,2,5,4,7,5,6,5,3,7,2,3,2,7,2,4,,,,6,2,,3,6,6,6,3,4,7,6,3,2,10,7,10,1,1,4,1,5,5,,2,1,1,,10,2,8,1,,2,2,3,2,1,2,3,0,0,,0,,0,0,1,0,0,2,1,8,1,1,8,1,1,2,,1,1,2,2,,2,2,1,1,1,7,2,1,2,2,8,50,5,5,3,1,2,2,1,2,4,4,4,1,1,1,1,1,1,1,1,1,1,1,1,5,1,4,1,1,,1,2,2,40
24,1219,4,2404,10701,10,7,10701,1,4,1,5,11,1,3,3,,0,,3,1,1,4,5,2,3,2,2,2,2,1,1,1,1,1,,1,3,3,2,2,2,2,1,2,,1,2,2,2,2,4,,11,3,0,1,0,,,3,1,2,2,2,2,2,2,2,2,2,2,2,2,2,,,,2,2,1,2,1,2,2,2,2,2,2,2,5,5,3,2,2,5,2,6,6,2,3,5,6,5,5,5,7,4,6,,6,5,3,4,5,3,6,6,3,3,7,7,1,3,3,10,10,10,1,1,1,1,1,8,2,2,2,1,10,10,10,10,1,2,2,2,3,2,1,2,2,0,0,,0,,0,0,0,0,0,2,1,1,1,1,8,1,1,2,,2,1,2,,,2,3,1,1,1,1,2,2,1,1,10,64,2,4,,,2,2,2,2,4,4,4,1,1,0,0,1,0,0,0,0,1,0,0,5,1,4,1,2,,2,1,,40
24,1221,5,2404,10701,10,7,10701,1,4,1,4,11,2,16,6,7,30,7,2,1,3,4,2,2,2,2,2,1,2,1,1,1,1,1,1,1,1,2,2,3,3,3,2,2,4,2,2,2,2,2,4,,6,2,0,2,0,,,4,2,2,2,1,2,1,2,2,2,2,2,2,2,2,,,,1,2,1,2,2,2,,2,2,2,2,2,5,5,4,4,4,5,2,7,4,2,3,5,6,6,5,5,7,4,6,3,6,2,3,5,5,4,5,5,3,3,7,7,3,3,3,10,10,10,1,1,1,1,5,1,1,1,5,1,,10,10,10,1,1,2,2,2,2,1,2,2,0,0,,0,,0,0,0,0,0,1,1,1,1,1,2,1,1,2,,2,1,2,,,2,3,1,1,1,6,2,2,2,2,11,40,,4,,,3,1,2,4,2,5,5,1,1,1,0,1,0,0,0,0,1,0,0,9,1,1,4,1,,1,1,,30
24,1251,4,2404,10701,10,7,10701,1,4,1,5,11,1,3,3,27,32,27,3,1,1,4,5,2,3,2,2,2,2,1,1,1,1,1,,1,3,3,2,2,2,2,1,2,,1,2,2,2,2,4,,11,3,0,1,0,,,3,1,2,2,2,2,2,2,2,2,2,2,2,2,2,,,,2,2,1,2,1,2,2,2,2,2,2,2,5,5,3,2,2,5,2,6,6,2,3,5,6,5,5,5,7,4,,,6,5,3,4,5,3,6,6,3,3,7,7,1,3,3,10,10,10,1,1,1,1,1,8,2,2,2,1,10,10,10,10,1,2,2,2,3,2,1,2,2,0,0,,0,,0,0,0,0,0,2,1,1,1,1,8,1,1,2,,2,1,2,,,2,3,1,1,1,1,2,2,1,1,4,26,,4,,,2,2,2,2,4,4,4,1,1,0,0,1,0,0,0,0,1,0,0,5,1,4,1,2,,2,1,,40
24,1252,4,2404,10701,10,7,10701,1,4,1,4,11,1,15,2,23,18,23,1,1,1,2,4,3,4,3,1,1,1,1,1,1,1,1,1,1,2,3,3,3,4,4,2,3,,2,,2,4,4,,2,10,4,0,0,0,,,4,0,1,,1,1,1,2,2,2,2,2,2,2,2,,,,1,2,1,3,,4,2,3,4,9,4,4,1,1,1,1,3,1,1,7,3,1,3,1,,4,3,1,,1,4,3,1,1,1,5,1,1,1,2,2,3,5,5,1,3,3,10,10,10,1,2,1,1,1,1,4,3,7,1,,10,7,9,1,2,2,2,4,2,1,1,1,0,0,,1,0,0,0,0,0,0,1,1,2,1,1,2,1,1,2,,1,1,2,1,2,3,3,4,1,7,7,2,2,2,1,11,67,5,0,,,,2,4,2,6,4,4,1,1,1,1,1,0,1,1,0,0,1,1,14,,,,,,1,1,,45
24,1259,4,2403,6809,6,8,6809,2,5,1,2,11,1,31,9,0,0,,2,2,4,4,3,2,2,2,2,2,2,1,1,2,,,,,4,4,4,4,4,4,3,3,4,2,2,1,4,3,1,2,5,3,0,1,0,,,3,2,1,2,1,1,1,1,1,,2,2,2,2,1,3,1,,1,4,3,3,2,4,2,2,2,2,2,2,3,4,5,3,4,5,2,4,3,2,4,5,2,3,4,2,5,6,7,3,5,2,1,2,2,2,2,3,4,3,4,5,6,2,2,4,3,5,4,3,6,2,4,8,5,4,5,4,5,4,3,2,1,3,2,2,3,2,1,2,2,1,0,,,1,,,0,1,1,2,1,1,2,1,2,2,2,,7,,2,,2,,3,4,1,2,2,6,2,1,2,1,6,24,4,1,,,2,2,3,1,0,6,6,1,1,1,0,0,0,0,0,0,1,1,0,9,1,4,2,2,,1,2,2,45
24,6,4,2401,4232,4,2,4232,1,1,1,2,11,1,5,3,26,,26,3,2,1,3,3,3,2,1,2,1,2,1,2,1,1,2,2,2,2,2,4,2,4,3,2,2,,2,2,2,4,1,2,2,4,2,0,1,0,,,3,2,2,1,1,2,1,2,2,2,2,2,1,2,2,,,,1,1,1,2,2,4,2,2,3,9,9,2,2,5,4,6,6,2,3,5,3,6,6,2,5,4,5,3,7,3,6,4,2,,5,5,6,4,5,3,2,2,6,3,5,2,3,9,9,8,2,1,1,2,3,1,4,7,9,5,6,9,8,9,1,2,2,2,2,2,1,2,3,1,0,,0,1,0,0,0,1,1,1,1,2,1,1,8,1,1,1,,3,2,,2,,2,3,1,3,3,7,2,2,2,2,11,32,7,5,3,2,1,,4,2,5,5,4,1,1,1,1,1,1,1,1,0,1,1,1,10,1,2,3,1,,1,1,,47
24,316,4,2402,4811,4,8,4811,2,5,1,5,11,1,59,13,3,0,13,1,2,2,4,4,3,3,3,2,2,2,1,2,1,1,1,1,2,2,3,3,4,,,2,2,5,2,2,2,2,2,1,1,11,2,0,2,1,2,1,2,2,2,2,1,2,2,2,2,2,2,2,1,2,2,,,,1,1,2,2,,,1,1,1,9,1,1,6,6,6,6,6,6,6,6,6,6,,6,7,6,6,6,7,6,,,6,6,6,2,2,2,3,3,4,2,4,5,1,2,2,9,10,9,4,1,1,1,1,4,5,6,6,6,7,7,8,9,1,3,2,2,1,1,1,2,2,0,0,0,0,,0,0,0,1,1,1,1,1,1,1,1,1,2,,7,,2,,2,,3,4,1,1,1,2,2,1,2,2,,32,7,5,,,2,1,3,3,2,3,3,1,1,1,0,1,0,0,0,0,1,1,0,2,1,4,1,2,,1,2,,40
24,325,4,2402,4811,4,8,4811,2,5,1,4,11,1,21,3,14,27,3,1,1,1,3,4,3,4,3,,2,,1,2,1,1,1,1,1,2,3,3,4,4,4,3,2,4,1,2,2,2,1,4,1,6,2,0,2,0,,,2,3,2,,1,,2,2,,2,,2,1,2,1,7,1,,2,2,2,2,2,4,1,2,2,2,2,2,4,4,4,4,4,4,4,4,5,5,5,5,5,6,7,5,7,5,6,,5,5,5,1,1,1,1,1,1,4,7,,5,2,2,10,9,8,2,4,5,1,1,10,8,9,9,4,10,,10,9,1,2,2,2,1,1,1,2,2,0,0,,0,,0,0,0,1,1,2,1,9,1,1,8,1,1,2,,1,1,2,2,,3,3,1,3,1,6,1,1,2,2,10,29,2,5,6,1,2,1,3,3,2,4,4,1,1,1,0,1,0,0,0,1,1,1,0,3,1,2,3,1,,1,1,,40
24,520,5,2403,2804,2,8,2804,2,5,1,4,11,2,3,,0,0,,1,1,3,4,2,1,2,1,1,2,2,1,2,2,,,,,2,2,4,4,4,4,2,1,10,2,2,2,2,1,3,2,1,2,0,2,0,,,2,2,2,2,2,2,2,1,2,2,2,2,2,2,2,,,,2,2,2,1,2,4,1,2,2,3,2,2,4,4,4,4,5,4,6,7,5,6,7,5,7,6,5,5,7,5,5,6,6,5,7,5,6,6,7,6,6,1,4,5,5,2,,6,7,7,7,6,7,6,7,6,7,6,6,6,5,6,5,5,5,2,1,2,4,2,2,2,2,0,0,,0,,,0,0,0,1,,1,2,1,1,2,1,1,1,,1,2,,2,,4,4,6,6,3,5,2,2,2,2,11,54,6,3,,,3,,3,6,11,6,6,1,1,1,0,1,0,0,0,0,1,1,0,5,1,2,4,1,,1,1,,40
24,808,6,2402,3815,3,8,3815,2,5,1,28,10,2,5,13,,0,,1,3,1,4,3,2,4,2,2,2,1,1,2,2,,,,,1,3,4,4,,,3,1,5,2,2,2,2,2,,,1,2,0,,0,,,,,,,,,,,,,,,2,,2,,,,2,2,3,2,,,,3,2,9,9,2,2,7,6,6,6,6,6,7,6,6,5,5,7,6,7,5,7,5,5,7,5,6,6,3,3,3,5,6,4,3,7,7,7,2,2,10,10,10,1,1,1,1,1,2,2,1,1,1,10,10,1,1,1,,2,,3,2,1,2,1,0,0,,,0,,0,0,1,1,2,1,8,1,8,8,1,1,3,,3,1,3,2,,4,4,1,3,1,6,2,,2,2,10,39,3,3,,,4,2,2,3,6,3,3,1,0,0,0,0,0,0,0,0,0,0,0,13,,,,,,2,1,,30
24,835,4,2403,5808,5,8,5808,2,5,1,28,10,1,5,26,,0,,2,1,1,3,2,3,3,3,1,1,2,1,2,2,,,,,2,2,2,4,4,4,2,2,,2,2,2,2,2,2,1,2,3,0,2,1,3,,3,2,2,2,2,2,2,1,1,2,2,2,1,2,2,,,,2,2,1,2,2,3,1,3,2,4,2,2,5,5,5,4,4,4,5,5,5,5,6,4,7,4,4,5,5,5,5,6,6,6,4,5,5,4,4,3,2,2,4,,,3,3,8,9,8,4,4,2,2,7,1,1,2,2,2,4,6,6,6,7,2,,1,4,2,1,3,3,1,0,0,0,0,,0,0,1,1,,1,1,1,2,2,1,1,1,,3,1,1,2,,4,,4,6,6,4,2,2,2,2,6,60,4,3,3,3,2,2,2,,2,4,5,1,0,0,0,0,0,0,0,0,0,0,0,,1,1,4,1,,2,1,,63
24,837,4,2403,5808,5,8,5808,2,5,1,29,10,2,30,15,14,0,6,2,2,2,4,2,3,3,3,2,2,2,1,2,2,,,,,2,3,4,4,4,3,2,2,5,2,3,2,3,,4,1,10,4,0,1,0,,,4,0,2,2,2,2,2,2,2,2,2,2,2,2,1,7,1,,2,3,1,2,2,3,,2,3,3,3,3,5,3,4,5,4,4,6,5,6,6,5,4,7,5,5,6,6,4,4,5,5,5,6,5,5,3,6,4,4,2,4,5,4,3,2,8,4,6,6,5,4,5,5,2,3,4,4,4,6,5,4,5,5,1,1,1,2,2,1,,,0,0,,0,0,0,0,0,0,1,2,1,8,1,1,8,1,1,6,,1,1,6,2,,3,3,4,4,2,4,2,2,2,2,,86,2,2,,,1,1,2,3,5,6,6,1,1,1,1,0,0,0,1,1,1,0,0,8,1,2,1,1,,1,1,,31
24,1041,4,2402,4805,4,8,4805,2,5,1,29,10,1,4,3,27,14,14,1,1,1,2,3,3,3,3,2,2,2,1,2,2,,,,,3,3,3,3,3,4,3,3,4,2,3,2,4,3,4,,10,4,0,0,0,,,3,1,2,2,1,2,1,2,2,2,2,1,1,1,1,1,1,,2,3,3,3,2,,,2,3,,,,1,1,2,1,2,1,2,3,4,2,3,5,7,6,5,3,2,1,,,6,5,1,2,2,2,1,2,1,3,6,5,4,4,3,4,4,2,1,1,1,1,1,2,2,3,4,3,5,8,8,8,1,2,2,2,2,2,3,2,2,0,0,,0,0,0,0,1,1,1,1,1,8,1,1,8,1,2,,7,,2,,1,1,3,3,2,3,1,5,2,2,2,2,,56,3,,,,3,,,1,10,6,6,1,1,1,0,0,0,0,0,0,1,1,0,6,2,,,,,,2,,40
24,1064,4,2402,4807,4,8,4807,2,5,1,31,10,1,1,27,,0,,4,2,3,4,4,3,2,3,2,2,2,1,2,1,2,1,1,1,3,3,3,4,4,4,3,3,5,2,2,2,2,2,3,1,5,2,0,2,1,2,0,2,2,2,2,1,1,1,2,1,1,2,1,1,2,2,,,,2,2,2,2,1,4,1,2,3,2,1,1,4,5,6,3,2,1,6,4,5,2,1,4,7,3,1,2,3,4,5,2,,1,,2,4,2,4,5,2,3,6,4,5,3,2,8,6,4,3,4,2,4,5,2,4,6,8,7,7,8,3,4,1,2,2,1,1,1,1,1,1,0,0,,0,,0,0,1,1,1,2,1,8,1,1,2,1,2,,3,,2,,2,,3,4,2,3,3,2,1,2,1,2,10,20,1,,6,2,3,1,1,1,0,5,9,1,1,1,1,1,1,1,1,0,1,1,1,2,1,2,4,2,,2,1,,35
24,1110,4,2402,4817,4,8,4817,2,5,1,5,11,1,58,1,0,0,,3,3,,4,4,3,4,3,2,2,1,1,2,2,,,,,4,4,4,4,4,4,3,3,7,2,3,2,4,3,4,2,10,,0,0,1,4,1,4,1,2,2,2,2,2,2,2,2,2,2,1,1,2,,,,2,3,2,3,1,3,2,4,4,9,9,9,3,5,4,4,4,4,3,5,3,2,2,3,5,5,5,4,7,3,4,4,2,2,1,2,2,3,4,4,3,3,5,5,5,3,3,1,1,2,1,1,1,1,5,3,3,2,2,4,3,3,4,4,8,3,2,2,4,2,1,2,2,0,0,0,0,,0,0,0,1,0,1,1,2,2,1,8,1,2,,2,,2,,2,,2,3,3,3,1,6,2,2,2,2,8,40,3,3,3,4,3,1,4,2,7,6,6,1,1,1,1,1,0,0,0,1,1,1,0,4,1,2,4,1,,1,1,,30
24,1148,4,2403,5810,5,8,5810,2,5,1,29,10,1,30,14,26,0,14,1,1,2,2,2,2,2,2,2,2,2,1,2,2,,,,,2,2,3,3,3,3,,,7,2,3,2,2,2,2,2,2,4,0,1,0,,,3,2,1,1,1,1,1,2,2,2,2,1,2,2,2,,,,2,2,1,1,2,3,,2,2,2,2,2,,4,4,4,3,5,3,6,5,6,,7,7,6,6,5,7,6,6,6,4,6,5,5,4,4,,4,4,2,6,6,6,3,3,9,9,9,4,8,2,1,4,3,3,4,4,4,7,7,8,8,4,3,1,2,1,1,3,3,3,0,1,0,0,0,0,1,1,1,1,1,1,8,1,1,8,1,1,1,,,1,1,2,,3,4,2,4,1,3,2,2,2,2,11,31,,2,,,3,2,2,2,0,6,6,1,1,1,1,1,1,0,0,0,0,0,1,10,1,3,2,1,,3,2,1,45