ID,A05,A02,HOG,D02,D03,D04,D05A,D05B,D05C,D06,D07,D08A,D08B,D14,D15,D16,D17,D18,D19,D20,D21,D22,D23,D24,D25,D26,D27,D28,D29,D30,D31,D32,D33,D34,D35,D36,D37,D38,D39,D40,D41,D42,D43,D44,D45,D46,D47,D50,D51,D54,D55,D56,D57,D58,D59_1,D59_2,D59_3,D59_4,D59_5,D59_6,D59_7,D59_8,D59_9,D59_10,D61,D62A,D62B,D62C,D62D,D62E,D62F,D63,D64_1,D64_2,D64_3,D64_4,D64_5,D64_6,D64_7,D64_8,D64_9,D64_10,D67,D69,D70,D71D,D71M,D71A,D72,D73,D74,D75,D76,D77,cluster,PVO,strata,member_idunique,A09_1,A09_2,A09_3,AT_HOG,AT_ENU,AT_HI,AT_MI,AT_ID,AT_DIA,AT_MES,AT_ANO,AT_SPID,AT_SPDIA,AT_SPMES,AT_SPANO,AT_HF,AT_MF,AT_ROPA,wom_count,birth_date,int_date,wom_age,eligible_women,MI_count1,foods_min,total_members,male_adult_max,female_adult_max,child_max,gendered_hh,HHWT,WMWT,MTWT,anthro_date,agedays,agemos,region,urbanr,sex,lorh,length,weight2,oedema,agedays3,CHWT,wgting,diarrhea,ORT,foods,liquids,breastfeeding,exclusive_breast,breast_status,age_0_23,DD1,DD2,DD3,DD4,DD5,DD6,DD7,DDseven,DDsix,meal_frequency,total_milk_feeds,total_feeds,MAD,DDseven_rec,DDsix_rec,Meal_frequency_rec1,Meal_frequency_rec2,nonbreast_feeds,zhaz,zBMI,zwaz,zwhz,whplus1,whplus2,whplus3,whmin2,whmin3,bmimin2,bmimin3,bmiplus1,bmiplus2,bmiplus3,hamin2,hamin3,wamin2,wamin3
2,5,33,2,2,7,2,19,2,2013,0,2,1,1,1,1,1,1, ,1,2,2,1,4,2, ,2,2,2, ,2,2,2,2,2,2,2,2,2,2,2,2,2,2,2,2,2,2,2, ,1,2,4,4,1,3, , , , , , , , , , ,8,1,8,8,1,8,1,1, , , , , , , , , ,7,2,1,19,2,13,5,51.5,8.8,1,1,2,533,2,21,207,2,4,2013,2,33,14,45,16,2,4,13,16,2,4,13,15,0,1,1,2/19/2013,4/2/2013,39,1,1,2,7,1,1,1,3,9,8.99999999999998,8.99999999999998,4/2/2013,42,1,2,1,2,1,51.5,3.991612856,n,42,8.99999999999998,8.99999999999998,1,1,0,1,1,0,5,1,0,0,1,0,0,0,0,1,0,0,4,4, ,0,0,0,0,0,-1.79,-.06,-1.02,.89,2,2,2,2,2,2,2,2,2,2,2,2,2,2
4,5,33,4,4,5,2,16,7,2009,3,45,1,1,1,2, , , , , , , , , , , , , , , , , , , , , , , , , , , , , , , , , , ,8, , , , , , , , , , , , , , , , , , , , , , , , , , , , , , , , ,5,2,45,16,7,9,5,86.2,27.7,1,2,2,533,2,21,405,2,4,2013,4,33,12,45,16,1,4,13,16,1,4,13,9,31,9,1,7/16/2009,4/2/2013,21,1,1, ,7,1,1,1,3,9,8.99999999999998,8.99999999999998,4/1/2013,1356,45,2,1,2,1,86.2,12.564508649,n,1355,8.99999999999998,8.99999999999998,0,997, , , , , , , , , , , , , , , , , , , , , , , , ,-3.63,1.27,-1.57,.96,2,2,2,2,2,2,2,1,2,2,1,1,2,2
4,5,33,4,4,6,1,28,7,2011,1,21,1,1,1,1,2, ,2,1,2,2,2, ,2, ,2,2,2, ,1,2,2,1,2,2,2,2,1,2,2,1,2,2,2,2,2,2, ,98,8, , , , , , , , , , , , , , , , , , , , , , , , , , , , , , , , ,6,1,21,28,7,11,5,70,17.3,1,1,2,533,2,21,406,2,4,2013,4,33,12,45,16,1,4,13,16,1,4,13,9,31,9,1,7/28/2011,4/2/2013,21,1,1,1,7,1,1,1,3,9,8.99999999999998,8.99999999999998,4/1/2013,614,20,2,1,1,1,70,7.847148001,n,613,8.99999999999998,8.99999999999998,0,997,1,1,0,0,1,7,1,0,0,0,1,0,1,3,3, ,0,0,0,0,0, , ,0,-5.08,.04,-3.28,-.87,2,2,2,2,2,2,2,2,2,2,1,1,1,1
4,5,33,4,4,7,2,13,11,2012,0,5,1,1,1,1,1,1, ,1,2,2,2, ,2, ,2,2,2, ,1,2,2,2,2,2,2,2,2,2,2,2,2,2,2,2,2,2,2, ,2, , , , , , , , , , , , , , , , , , , , , , , , , , , , , , , , ,7,2,5,13,11,12,5,56.8,11.9,1,1,2,533,2,21,407,2,4,2013,4,33,12,45,16,1,4,13,16,1,4,13,9,31,9,1,11/13/2012,4/2/2013,21,1,1,2,7,1,1,1,3,9,8.99999999999998,8.99999999999998,4/1/2013,140,5,2,1,2,1,56.8,5.397749203,n,139,8.99999999999998,8.99999999999998,0,997,0,1,1,0,4,3,1,0,0,0,0,0,0,1,1,0,0,0, ,0,0,0,0,0,-2.93,-.03,-1.76,.76,2,2,2,2,2,2,2,2,2,2,1,2,2,2
5,5,33,5,4,11,1,26,3,2008,5,61,1,1,2, , , , , , , , , , , , , , , , , , , , , , , , , , , , , , , , , , , , , , , , , , , , , , , , , , , , , , , , , , , , , , , , , , , , , , , , , , , , , , , , ,533,2,21,511,1,4,2013,5,33,11,40,16,1,4,13,16,1,4,13,12,15,3,1,3/26/2008,4/1/2013,26,1,1, ,11,1,1,1,3,9,26.9999999999999,8.99999999999998,4/1/2013,1832,60,2,1,1, , , ,n,1832,8.99999999999998,8.99999999999998, , , , , , , , , , , , , , , , , , , , , , , , , , , , , , , , , , , , , , , , , , , , 
6,5,33,6,5,8,1,23,2,2013,0,2,1,1,1,1,1,1, ,2,2,2,2, ,2, ,2,2,2, ,2,2,2,2,2,2,2,2,2,2,2,2,2,2,2,2,2,2,2, ,2, , , , , , , , , , , , , , , , , , , , , , , , , , , , , , , , ,8,1,1,23,2,13,2,51.7,7.3,1,1,2,533,2,21,608,1,4,2013,6,33,11,56,16,1,4,13,16,1,4,13,11,59,2,1,2/23/2013,4/1/2013,17,1,1,2,8,1,1,1,3,9,26.9999999999999,8.99999999999998,4/1/2013,37,1,2,1,1,1,51.7,3.311224301,n,37,8.99999999999998,8.99999999999998,0,997,0,0,1,1,2,1,0,0,0,0,0,0,0,0,0,0,0,0, ,0,0,0,0,0,-1.99,-2.35,-2.62,-1.27,2,2,2,2,2,1,2,2,2,2,2,2,1,2
7,5,33,7,2,5,2,3,9,2008,4,55,1,1,1,2, , , , , , , , , , , , , , , , , , , , , , , , , , , , , , , , , , ,2, , , , , , , , , , , , , , , , , , , , , , , , , , , , , , , , ,5,2,55,3,9,8,1,97.2,33.6,2,1,2,533,2,21,705,2,4,2013,7,33,15,40,16,2,4,13,16,2,4,13,16,12,2,1,9/3/2008,4/2/2013,26,1,1, ,6,1,1,1,3,9,8.99999999999998,8.99999999999998,4/2/2013,1672,55,2,1,2,2,97.2,15.240703632,n,1672,8.99999999999998,8.99999999999998,0,997, , , , , , , , , , , , , , , , , , , , , , , , ,-2.08,.58,-.91,.58,2,2,2,2,2,2,2,2,2,2,1,2,2,2
7,5,33,7,2,6,2,6,6,2011,1,22,1,1,1,1,1,1, ,2,2,2,2, ,1,2,2,2,2, ,1,2,2,1,2,1,2,2,2,2,2,1,2,2,2,1,2,2, ,3,1,2,2,2,2, , , , , , , , , , , ,1,2,2,1,2,8,2, , , , , , , , , , ,6,2,22,6,6,11,3,71,16.9,1,1,2,533,2,21,706,2,4,2013,7,33,15,40,16,2,4,13,16,2,4,13,16,12,2,1,6/6/2011,4/2/2013,26,1,1,1,6,1,1,1,3,9,8.99999999999998,8.99999999999998,4/2/2013,666,22,2,1,2,1,71,7.665711053,n,666,8.99999999999998,8.99999999999998,1,0,1,1,1,0,6,7,1,0,1,0,1,0,0,3,2,3,2,5,0,0,0,1,1,1,-4.33,-.21,-3.1,-.98,2,2,2,2,2,2,2,2,2,2,1,1,1,1
10,5,33,10,2,11,1,13,6,2008,4,58,1,1,1,2, , , , , , , , , , , , , , , , , , , , , , , , , , , , , , , , , , ,1,2,2,2,1,6, , , , , , , , , , ,2,2,8,1,2,8,2, , , , , , , , , , ,11,1,58,13,6,8,3,88,25.1,2,1,2,533,2,21,1011,1,4,2013,10,33,14,31,16,1,4,13,16,1,4,13,15,0,1,1,6/13/2008,4/1/2013,15,1,1, ,12,1,1,1,3,9,35.9999999999999,8.99999999999998,4/1/2013,1753,58,2,1,1,2,88,11.385168487,n,1753,8.99999999999998,8.99999999999998,1,0, , , , , , , , , , , , , , , , , , , , , , , , ,-4.54,-.4,-3.46,-1.08,2,2,2,2,2,2,2,2,2,2,1,1,1,1
10,5,33,10,2,12,2,2,5,2010,3,35,1,1,1,2, , , , , , , , , , , , , , , , , , , , , , , , , , , , , , , , , , ,1,2,2,2,1,6, , , , , , , , , , ,2,1,2,1,1,8,2, , , , , , , , , , ,12,2,35,2,5,10,3,78,22.4,2,1,2,533,2,21,1012,1,4,2013,10,33,14,31,16,1,4,13,16,1,4,13,15,0,1,1,5/2/2010,4/1/2013,15,1,1, ,12,1,1,1,3,9,35.9999999999999,8.99999999999998,4/1/2013,1065,35,2,1,2,2,78,10.160469088,n,1065,8.99999999999998,8.99999999999998,1,1, , , , , , , , , , , , , , , , , , , , , , , , ,-4.34,.92,-2.41,.36,2,2,2,2,2,2,2,2,2,2,1,1,1,2
11,5,33,11,9,10,2,2,8,2011,1,20,1,1,1,1,1,1, ,2,2,1,2, ,2, ,2,2,2, ,2,2,2,1,2,2,2,2,2,2,2,2,2,1,2,2,2,2, ,3,2, , , , , , , , , , , , , , , , , , , , , , , , , , , , , , , , ,10,2,20,2,8,11,3,75.5,20.9,1,1,2,533,2,21,1110,5,4,2013,11,33,9,6,16,5,4,13,16,5,4,13,16,37,3,1,8/2/2011,4/5/2013,30,1,1,1,10,1,1,1,3,9,53.9999999999999,8.99999999999998,4/5/2013,612,20,2,1,2,1,75.5,9.480080533,n,612,8.99999999999998,8.99999999999998,0,997,1,1,1,0,6,7,1,1,0,0,0,0,0,2,2,3,0,3,0,0,0,1,1,0,-2.42,.75,-.97,.28,2,2,2,2,2,2,2,2,2,2,1,2,2,2
12,5,33,12,4,10,2,9,8,2007,5,68,1,1,2, , , , , , , , , , , , , , , , , , , , , , , , , , , , , , , , , , , , , , , , , , , , , , , , , , , , , , , , , , , , , , , , , , , , , , , , , , , , , , , , ,533,2,21,1210,2,4,2013,12,33,10,50,16,2,4,13,16,2,4,13,12,5,2,1,8/9/2007,4/2/2013,20,1,1, ,14,1,1,1,3,9,26.9999999999999,18,4/2/2013,2063,68,2,1,2, , , ,n,2063,8.99999999999998,8.99999999999998, , , , , , , , , , , , , , , , , , , , , , , , , , , , , , , , , , , , , , , , , , , , 
12,5,33,12,3,11,1,16,3,2009,4,49,1,1,1,2, , , , , , , , , , , , , , , , , , , , , , , , , , , , , , , , , , ,1,2,2,2,1,4, , , , , , , , , , ,2,2,2,2,1,2,2, , , , , , , , , , ,11,1,49,16,3,9,1,89.6,28.9,2,1,2,533,2,21,1211,2,4,2013,12,33,10,50,16,2,4,13,16,2,4,13,12,5,2,1,3/16/2009,4/2/2013,20,1,1, ,14,1,1,1,3,9,26.9999999999999,18,4/2/2013,1478,49,2,1,1,2,89.6,13.108819493,n,1478,8.99999999999998,8.99999999999998,1,0, , , , , , , , , , , , , , , , , , , , , , , , ,-3.33,.76,-1.79,.3,2,2,2,2,2,2,2,2,2,2,1,1,2,2
12,5,33,12,4,12,2,14,10,2011,1,18,1,1,1,1,1,1, ,1,2,2,2, ,2, ,2,2,2, ,1,1,2,1,2,2,2,2,2,2,2,1,2,1,2,2,2,2, ,3,2, , , , , , , , , , , , , , , , , , , , , , , , , , , , , , , , ,12,2,18,14,10,11,1,73,18,1,1,2,533,2,21,1212,2,4,2013,12,33,10,50,16,2,4,13,16,2,4,13,12,5,2,1,10/14/2011,4/2/2013,20,1,1,1,14,1,1,1,3,9,26.9999999999999,18,4/2/2013,536,18,2,1,2,1,73,8.16466266,n,536,8.99999999999998,8.99999999999998,0,997,1,1,1,0,6,7,1,1,0,0,1,0,0,3,3,3,0,3,0,0,0,1,1,0,-2.54,-.33,-1.82,-.8,2,2,2,2,2,2,2,2,2,2,1,2,2,2
12,5,33,12,3,13,1,6,11,2010,2,29,1,1,1,2, , , , , , , , , , , , , , , , , , , , , , , , , , , , , , , , , , ,2, , , , , , , , , , , , , , , , , , , , , , , , , , , , , , , , ,13,1,29,6,11,10,1,79,23.6,2,1,2,533,2,21,1213,2,4,2013,12,33,10,50,16,2,4,13,16,2,4,13,12,5,2,1,11/6/2010,4/2/2013,20,1,1, ,14,1,1,1,3,9,26.9999999999999,18,4/2/2013,878,29,2,1,1,2,79,10.704779932,n,878,8.99999999999998,8.99999999999998,0,997, , , , , , , , , , , , , , , , , , , , , , , , ,-3.61,1,-1.72,.35,2,2,2,2,2,2,2,2,2,2,1,1,2,2
13,5,33,13,3,6,2,4,4,2009,3,48,1,1,1,2, , , , , , , , , , , , , , , , , , , , , , , , , , , , , , , , , , ,2, , , , , , , , , , , , , , , , , , , , , , , , , , , , , , , , ,6,2,48,4,4,9,5,95.1,30.6,2,1,2,533,2,21,1306,2,4,2013,13,33,11,50,16,2,4,13,16,2,4,13,12,0,2,1,4/4/2009,4/2/2013,22,1,1, ,6,1,1,1,3,9,26.9999999999999,8.99999999999998,4/2/2013,1459,48,2,1,2,2,95.1,13.879926522,n,1459,8.99999999999998,8.99999999999998,0,997, , , , , , , , , , , , , , , , , , , , , , , , ,-1.76,.06,-1.08,-.03,2,2,2,2,2,2,2,2,2,2,2,2,2,2
15,5,33,15,2,6,1,22,8,2007,5,68,1,1,2, , , , , , , , , , , , , , , , , , , , , , , , , , , , , , , , , , , , , , , , , , , , , , , , , , , , , , , , , , , , , , , , , , , , , , , , , , , , , , , , ,533,2,21,1506,2,4,2013,15,33,13,50,16,2,4,13,16,2,4,13,13,56,3,1,8/22/2007,4/2/2013,32,1,0, ,6,1,1,1,3,9,8.99999999999998, ,4/2/2013,2050,67,2,1,1, , , ,n,2050,8.99999999999998,8.99999999999998, , , , , , , , , , , , , , , , , , , , , , , , , , , , , , , , , , , , , , , , , , , , 
16,5,33,16,2,3,1,16,7,2009,3,45,1,1,1,2, , , , , , , , , , , , , , , , , , , , , , , , , , , , , , , , , , ,2, , , , , , , , , , , , , , , , , , , , , , , , , , , , , , , , ,3,1,45,16,7,9,5,83,27.6,2,1,2,533,2,21,1603,3,4,2013,16,33,11,35,16,3,4,13,16,3,4,13,11,50,3,1,7/16/2009,4/3/2013,20,1,1, ,3,1,1,1,3,9,8.99999999999998,8.99999999999998,4/3/2013,1357,45,2,1,1,2,83,12.519149412,n,1357,8.99999999999998,8.99999999999998,0,997, , , , , , , , , , , , , , , , , , , , , , , , ,-4.52,1.99,-1.86,1.33,1,2,2,2,2,2,2,1,2,2,1,1,2,2
19,5,33,19,2,4,2,10,11,2009,3,41,1,1,1,2, , , , , , , , , , , , , , , , , , , , , , , , , , , , , , , , , , ,1,2,3,3,1,4, , , , , , , , , , ,1,1,2,2,2,2,2, , , , , , , , , , ,4,2,41,10,11,9,3,90.1,29.5,2,1,2,533,2,21,1904,3,4,2013,19,33,14,47,16,3,4,13,16,3,4,13,14,57,3,1,11/10/2009,4/3/2013,22,1,1, ,5,1,1,1,3,9,8.99999999999998,8.99999999999998,4/3/2013,1240,41,2,1,2,2,90.1,13.380974915,n,1240,8.99999999999998,8.99999999999998,1,1, , , , , , , , , , , , , , , , , , , , , , , , ,-2.03,.82,-.74,.61,2,2,2,2,2,2,2,2,2,2,1,2,2,2
19,5,33,19,2,5,2,5,4,2011,2,24,1,1,1,2, , , , , , , , , , , , , , , , , , , , , , , , , , , , , , , , , , ,1,2,3,3,1,4, , , , , , , , , , ,1,1,2,2,2,2,1,98, , , , , , , , , ,5,2,24,5,4,11,3,80.1,20,2,1,2,533,2,21,1905,3,4,2013,19,33,14,47,16,3,4,13,16,3,4,13,14,57,3,1,4/5/2011,4/3/2013,22,1,1, ,5,1,1,1,3,9,8.99999999999998,8.99999999999998,4/3/2013,729,24,2,1,2,2,80.1,9.0718474,n,729,8.99999999999998,8.99999999999998,1,1, , , , , , , , , , , , , , , , , , , , , , , , ,-1.73,-1.25,-1.96,-1.4,2,2,2,2,2,2,2,2,2,2,2,2,2,2
25,5,33,25,2,5,1,15,7,2007,5,69,1,1,2, , , , , , , , , , , , , , , , , , , , , , , , , , , , , , , , , , , , , , , , , , , , , , , , , , , , , , , , , , , , , , , , , , , , , , , , , , , , , , , , ,533,2,21,2505,4,4,2013,25,33,13,25,16,4,4,13,16,4,4,13,13,40,3,1,7/15/2007,4/4/2013,34,1,1, ,5,1,1,1,3,9,8.99999999999998,8.99999999999998,4/4/2013,2090,69,2,1,1, , , ,n,2090,8.99999999999998,8.99999999999998, , , , , , , , , , , , , , , , , , , , , , , , , , , , , , , , , , , , , , , , , , , , 
28,5,33,28,8,9,2,26,2,2012,1,14,1,1,1,1,1,1, ,2,2,2,2, ,2, ,1,1,2, ,1,2,2,1,2,1,2,2,1,2,2,1,2,1,2,1,2,2, ,3,2, , , , , , , , , , , , , , , , , , , , , , , , , , , , , , , , ,9,2,14,26,2,12,4,69.5,17.2,1,1,2,533,2,21,2809,4,4,2013,28,33,12,10,16,4,4,13,16,4,4,13,12,25,2,1,2/26/2012,4/4/2013,21,1,1,1,9,1,1,1,3,9,26.9999999999999,8.99999999999998,4/4/2013,403,13,2,1,2,1,69.5,7.801788764,n,403,8.99999999999998,8.99999999999998,0,997,1,1,1,0,6,6,1,1,0,0,1,0,1,4,4,3,0,3,1,1,1,1,1,0,-2.27,-.04,-1.39,-.36,2,2,2,2,2,2,2,2,2,2,1,2,2,2
39,5,33,39,1,7,2,30,12,2010,2,28,1,1,1,2, , , , , , , , , , , , , , , , , , , , , , , , , , , , , , , , , , ,1,2,2,2,1,6, , , , , , , , , , ,1,1,1,1,1,2,2, , , , , , , , , , ,7,2,28,30,12,10,3,78.5,23.1,2,1,2,533,2,21,3907,5,4,2013,39,33,15,46,16,5,4,13,16,5,4,13,16,0,2,1,12/30/2010,4/5/2013,42,1,1, ,7,1,1,1,3,9,8.99999999999998,8.99999999999998,4/5/2013,827,27,2,1,2,2,78.5,10.477983747,n,827,8.99999999999998,8.99999999999998,1,1, , , , , , , , , , , , , , , , , , , , , , , , ,-2.93,1,-1.2,.59,2,2,2,2,2,2,2,2,2,2,1,2,2,2
40,5,33,40,1,3,2,2,12,2008,4,52,1,1,1,2, , , , , , , , , , , , , , , , , , , , , , , , , , , , , , , , , , ,2, , , , , , , , , , , , , , , , , , , , , , , , , , , , , , , , ,3,2,52,2,12,8,3,93.5,33.4,2,1,2,533,2,21,4003,5,4,2013,40,33,15,27,16,5,4,13,16,5,4,13,15,35,2,1,12/2/2008,4/5/2013,23,1,1, ,3,0,1,1,1,9,8.99999999999998,8.99999999999998,4/5/2013,1585,52,2,1,2,2,93.5,15.149985158,n,1585,8.99999999999998,8.99999999999998,0,997, , , , , , , , , , , , , , , , , , , , , , , , ,-2.6,1.31,-.74,1.25,1,2,2,2,2,2,2,1,2,2,1,2,2,2
43,5,26,3,2,4,2,17,8,2007,5,68,2,2,2, , , , , , , , , , , , , , , , , , , , , , , , , , , , , , , , , , , , , , , , , , , , , , , , , , , , , , , , , , , , , , , , , , , , , , , , , , , , , , , , ,526,2,21,4304,1,4,2013,3,26,11,22,15,1,4,13,15,1,4,13,11,34,3,1,8/17/2007,4/1/2013,43,1,1, ,6,1,1,1,3,4.5,4.5,4.5,4/1/2013,2054,68,2,1,2, , , ,n,2054,4.5,4.5, , , , , , , , , , , , , , , , , , , , , , , , , , , , , , , , , , , , , , , , , , , , 
43,5,26,3,2,5,2,26,11,2009,3,41,1,1,1,2, , , , , , , , , , , , , , , , , , , , , , , , , , , , , , , , , , ,2, , , , , , , , , , , , , , , , , , , , , , , , , , , , , , , , ,5,2,41,26,11,9,3,84.9,26.2,2,1,2,526,2,21,4305,1,4,2013,3,26,11,22,15,1,4,13,15,1,4,13,11,34,3,1,11/26/2009,4/1/2013,43,1,1, ,6,1,1,1,3,4.5,4.5,4.5,4/1/2013,1222,40,2,1,2,2,84.9,11.884120094,n,1222,4.5,4.5,0,997, , , , , , , , , , , , , , , , , , , , , , , , ,-3.25,.82,-1.63,.49,2,2,2,2,2,2,2,2,2,2,1,1,2,2
44,5,26,4,8,9,2,22,2,2012,1,14,1,1,1,1,1,1, ,2,2,2,2, ,2, ,2,2,2, ,1,2,1,1,2,2,1,2,2,1,2,2,2,1,2,2,2,2, ,2,1,2,2,2,1,7, , , , , , , , , , ,2,2,2,1,1,2,1,1, , , , , , , , , ,9,2,14,22,2,12,3,68,17.6,1,1,2,526,2,21,4409,2,4,2013,4,26,9,57,15,2,4,13,15,2,4,13,15,14,2,1,2/22/2012,4/2/2013,34,1,1,1,9,1,1,1,3,4.5,13.5,4.5,4/2/2013,405,13,2,1,2,1,68,7.983225712,n,405,4.5,4.5,1,0,1,1,1,0,6,6,1,1,0,1,0,1,0,4,4,2,0,2,0,1,1,1,0,0,-2.86,.72,-1.21,.33,2,2,2,2,2,2,2,2,2,2,1,2,2,2
47,5,26,7,3,5,2,22,3,2011,2,25,1,1,1,2, , , , , , , , , , , , , , , , , , , , , , , , , , , , , , , , , , ,2, , , , , , , , , , , , , , , , , , , , , , , , , , , , , , , , ,5,2,25,22,3,11,4,79.4,21.1,2,1,2,526,2,21,4705,1,4,2013,7,26,12,12,15,1,4,13,15,1,4,13,12,53,3,1,3/22/2011,4/1/2013,28,1,1, ,5,1,1,1,3,4.5,4.5,4.5,4/1/2013,741,24,2,1,2,2,79.4,9.570799007,n,741,4.5,4.5,0,997, , , , , , , , , , , , , , , , , , , , , , , , ,-2.04,-.38,-1.56,-.62,2,2,2,2,2,2,2,2,2,2,1,2,2,2
49,5,26,9,1,6,2,16,11,2008,4,53,1,1,1,2, , , , , , , , , , , , , , , , , , , , , , , , , , , , , , , , , , ,2, , , , , , , , , , , , , , , , , , , , , , , , , , , , , , , , ,6,2,53,16,11,8,3,96.5,29.8,2,1,2,526,2,21,4906,1,4,2013,9,26,16,5,15,2,4,13,15,2,4,13,16,12,3,1,11/16/2008,4/1/2013,40,1,1, ,6,1,1,1,3,4.5,9.00000000000001,4.5,4/2/2013,1597,53,2,1,2,2,96.5,13.517052626,n,1598,4.5,4.5,0,997, , , , , , , , , , , , , , , , , , , , , , , , ,-1.97,-.53,-1.62,-.61,2,2,2,2,2,2,2,2,2,2,2,2,2,2
52,5,26,12,2,3,1,19,3,2010,3,37,1,1,1,2, , , , , , , , , , , , , , , , , , , , , , , , , , , , , , , , , , ,2, , , , , , , , , , , , , , , , , , , , , , , , , , , , , , , , ,3,1,37,19,3,10,5,91.1,32.8,2,1,2,526,2,21,5203,2,4,2013,12,26,15,28,15,2,4,13,15,2,4,13,15,38,1,1,3/19/2010,4/2/2013,27,1,1, ,3,1,1,1,3,4.5,4.5,4.5,4/2/2013,1110,36,2,1,1,2,91.1,14.877829736,n,1110,4.5,4.5,0,997, , , , , , , , , , , , , , , , , , , , , , , , ,-1.42,1.73,.26,1.51,1,2,2,2,2,2,2,1,2,2,2,2,2,2
58,5,26,18,2,10,2,20,9,2009,3,43,1,1,1,2, , , , , , , , , , , , , , , , , , , , , , , , , , , , , , , , , , ,2, , , , , , , , , , , , , , , , , , , , , , , , , , , , , , , , ,10,2,43,20,9,9,3,88.9,29.3,2,1,2,526,2,21,5810,2,4,2013,18,26,13,45,15,2,4,13,15,2,4,13,13,54,1,1,9/20/2009,4/2/2013,19,1,1, ,10,1,1,1,3,4.5,9.00000000000001,4.5,4/2/2013,1290,42,2,1,2,2,88.9,13.290256441,n,1290,4.5,4.5,0,997, , , , , , , , , , , , , , , , , , , , , , , , ,-2.55,1.04,-.94,.79,2,2,2,2,2,2,2,1,2,2,1,2,2,2
61,5,26,35,2,8,1,7,12,2007,5,64,1,1,2, , , , , , , , , , , , , , , , , , , , , , , , , , , , , , , , , , , , , , , , , , , , , , , , , , , , , , , , , , , , , , , , , , , , , , , , , , , , , , , , ,526,2,21,6108,4,4,2013,35,26,11,34,15,4,4,13,15,4,4,13,11,35,1,1,12/7/2007,4/4/2013,17,1,1, ,8,1,1,1,3,4.5,13.5,4.5,4/4/2013,1945,64,2,1,1, , , ,n,1945,4.5,4.5, , , , , , , , , , , , , , , , , , , , , , , , , , , , , , , , , , , , , , , , , , , , 
62,5,26,22,1,2,2,17,5,2008,4,59,1,1,1,2, , , , , , , , , , , , , , , , , , , , , , , , , , , , , , , , , , ,2, , , , , , , , , , , , , , , , , , , , , , , , , , , , , , , , ,2,2,59,17,5,8,5,100.9,38.9,2,1,2,526,2,21,6202,4,4,2013,22,26,14,58,15,3,4,13,15,3,4,13,14,31,3,1,5/17/2008,4/4/2013,18,1,1, ,3,0,1,1,1,4.5,9.00000000000001,4.5,4/3/2013,1783,59,2,1,2,2,100.9,17.644743193,n,1782,4.5,4.5,0,997, , , , , , , , , , , , , , , , , , , , , , , , ,-1.65,1.26,-.12,1.4,1,2,2,2,2,2,2,1,2,2,2,2,2,2
63,5,26,23,2,6,1,15,7,2010,2,33,1,1,1,2, , , , , , , , , , , , , , , , , , , , , , , , , , , , , , , , , , ,2, , , , , , , , , , , , , , , , , , , , , , , , , , , , , , , , ,6,1,33,15,7,10,5,84.3,25.4,2,1,2,526,2,21,6306,3,4,2013,23,26,9,48,15,3,4,13,15,3,4,13,10,0,9,1,7/15/2010,4/3/2013,17,1,1, ,7,1,1,1,3,4.5,18,4.5,4/3/2013,993,33,2,1,1,2,84.3,11.521246198,n,993,4.5,4.5,0,997, , , , , , , , , , , , , , , , , , , , , , , , ,-2.68,.4,-1.5,.02,2,2,2,2,2,2,2,2,2,2,1,2,2,2
68,5,26,28,2,6,2,18,8,2008,4,56,1,1,1,2, , , , , , , , , , , , , , , , , , , , , , , , , , , , , , , , , , ,1,2,4,3,1,3, , , , , , , , , , ,1,8,8,8,8,8,1,1, , , , , , , , , ,6,2,56,18,8,8,5,100.8,35.6,2,1,2,526,2,21,6806,4,4,2013,28,26,15,16,15,3,4,13,15,3,4,13,15,30,1,1,8/18/2008,4/4/2013,15,1,1, ,7,1,1,1,3,4.5,18,4.5,4/3/2013,1690,56,2,1,2,2,100.8,16.147888372,n,1689,4.5,4.5,1,1, , , , , , , , , , , , , , , , , , , , , , , , ,-1.35,.42,-.53,.48,2,2,2,2,2,2,2,2,2,2,2,2,2,2
69,5,26,29,3,8,2,5,6,2010,2,34,1,1,1,2, , , , , , , , , , , , , , , , , , , , , , , , , , , , , , , , , , ,1,2,2,1,2, , , , , , , , , , , ,1,2,8,8,8,8,2, , , , , , , , , , ,8,2,34,5,6,10,5,94.6,31.9,2,1,2,526,2,21,6908,3,4,2013,29,26,11,18,15,3,4,13,15,3,4,13,11,33,3,1,6/5/2010,4/3/2013,22,1,1, ,9,1,1,1,3,4.5,22.5,4.5,4/3/2013,1033,34,2,1,2,2,94.6,14.469596603,n,1033,4.5,4.5,1,0, , , , , , , , , , , , , , , , , , , , , , , , ,.27,.54,.56,.53,2,2,2,2,2,2,2,2,2,2,2,2,2,2
69,5,26,29,3,9,2,1,6,2012,0,10,1,1,1,1,1,2,2,2,2,2,2, ,2, ,1,2,2, ,1,1,2,1,2,2,2,2,1,2,2,1,2,2,2,1,2,2, ,3,2, , , , , , , , , , , , , , , , , , , , , , , , , , , , , , , , ,9,2,10,1,6,12,5,81.5,23.2,1,1,2,526,2,21,6909,3,4,2013,29,26,11,18,15,3,4,13,15,3,4,13,11,33,3,1,6/1/2012,4/3/2013,22,1,1,1,9,1,1,1,3,4.5,22.5,4.5,4/3/2013,306,10,2,1,2,1,81.5,10.523342984,n,306,4.5,4.5,0,997,1,1,0,0,1,5,1,0,0,0,1,0,1,3,3,3,0,3,0,0,0,1,1,0,4.03,-.54,1.72,.13,2,2,2,2,2,2,2,2,2,2,2,2,2,2
71,5,26,31,2,5,1,4,5,2009,3,47,1,1,1,2, , , , , , , , , , , , , , , , , , , , , , , , , , , , , , , , , , ,2, , , , , , , , , , , , , , , , , , , , , , , , , , , , , , , , ,5,1,47,4,5,9,5,94.5,31.8,2,1,2,526,2,21,7105,4,4,2013,31,26,14,5,15,4,4,13,15,4,4,13,14,42,2,1,5/4/2009,4/4/2013,40,1,1, ,5,1,1,1,3,4.5,9.00000000000001,4.5,4/4/2013,1431,47,2,1,1,2,94.5,14.424237366,n,1431,4.5,4.5,0,997, , , , , , , , , , , , , , , , , , , , , , , , ,-1.99,.62,-.91,.42,2,2,2,2,2,2,2,2,2,2,2,2,2,2
73,5,26,33,2,5,1,30,8,2011,1,20,1,1,1,1,1,2,2,2,2,1,2, ,1,3,2,1,2, ,1,2,2,1,2,2,1,2,1,2,2,2,2,2,1,1,2,2, ,98,1,2,2,3,1,4,96, , , , , , , , ,4,1,1,1,2,1,2,1,5, , , , , , , , , ,5,1,20,30,8,11,3,79.4,21.8,1,1,1,526,2,21,7305,4,4,2013,33,26,10,42,15,4,4,13,15,4,4,13,10,51,3,1,8/30/2011,4/4/2013,16,1,1,1,5,1,1,1,3,4.5,4.5,4.5,4/4/2013,583,19,2,1,1,1,79.4,9.888313666,y,583,4.5,4.5,1,1,1,1,0,0,1,7,1,0,1,0,0,1,1,4,3, ,3,3,0,1,0, , ,0, , , , , , , , , , , , , , , , , , 
74,5,26,34,2,3,2,23,12,2007,5,64,1,1,2, , , , , , , , , , , , , , , , , , , , , , , , , , , , , , , , , , , , , , , , , , , , , , , , , , , , , , , , , , , , , , , , , , , , , , , , , , , , , , , , ,526,2,21,7403,5,4,2013,34,26,16,20,15,4,4,13,15,4,4,13,16,24,3,1,12/23/2007,4/5/2013,31,1,1, ,5,1,1,1,3,4.5,4.5,4.5,4/4/2013,1930,63,2,1,2, , , ,n,1929,4.5,4.5, , , , , , , , , , , , , , , , , , , , , , , , , , , , , , , , , , , , , , , , , , , , 
74,5,26,34,2,4,2,23,8,2010,2,32,1,1,1,2, , , , , , , , , , , , , , , , , , , , , , , , , , , , , , , , , , ,1,2,3,2,1,96, , , , , , , , , , ,1,1,1,1,2,2,2, , , , , , , , , , ,4,2,32,23,8,10,5,83.2,23.6,2,1,2,526,2,21,7404,5,4,2013,34,26,16,20,15,4,4,13,15,4,4,13,16,24,3,1,8/23/2010,4/5/2013,31,1,1, ,5,1,1,1,3,4.5,4.5,4.5,4/4/2013,956,31,2,1,2,2,83.2,10.704779932,n,955,4.5,4.5,1,1, , , , , , , , , , , , , , , , , , , , , , , , ,-2.37,-.02,-1.57,-.26,2,2,2,2,2,2,2,2,2,2,1,2,2,2
74,5,26,34,2,5,1,29,11,2012,0,5,1,1,1,1,1,1, ,2,2,2,2, ,2, ,2,2,2, ,2,2,2,2,2,2,2,2,2,2,2,2,2,2,2,2,2,2,2, ,2, , , , , , , , , , , , , , , , , , , , , , , , , , , , , , , , ,5,1,5,29,11,12,5,58.7,12,1,1,2,526,2,21,7405,5,4,2013,34,26,16,20,15,4,4,13,15,4,4,13,16,24,3,1,11/29/2012,4/5/2013,31,1,1,2,5,1,1,1,3,4.5,4.5,4.5,4/4/2013,127,4,2,1,1,1,58.7,5.44310844,n,126,4.5,4.5,0,997,0,0,1,1,2,3,0,0,0,0,0,0,0,0,0,0,0,0, ,0,0,0,0,0,-2.63,-1.01,-2.29,-.39,2,2,2,2,2,2,2,2,2,2,1,2,1,2
75,1,14,14,2,5,1,15,9,2007,5,67,1,1,2, , , , , , , , , , , , , , , , , , , , , , , , , , , , , , , , , , , , , , , , , , , , , , , , , , , , , , , , , , , , , , , , , , , , , , , , , , , , , , , , ,114,1,11,7505,2,4,2013, , , , , , , , , , , , , , , ,0,9/15/2007,4/2/2013,999,0,0, ,5,1,1,1,3,24.8340874811463, , ,4/2/2013,2026,67,1,1,1, , , ,n,2026,24.8340874811463,24.8340874811463, , , , , , , , , , , , , , , , , , , , , , , , , , , , , , , , , , , , , , , , , , , , 
76,1,14,15,1,4,1,20,7,2008,4,57,1,1,1,2, , , , , , , , , , , , , , , , , , , , , , , , , , , , , , , , , , ,2, , , , , , , , , , , , , , , , , , , , , , , , , , , , , , , , ,4,1,57,20,7,8,3,99.2,35.3,2,1,2,114,1,11,7604,2,4,2013,15,14,12,3,7,2,4,13,7,2,4,13,12,10,1,1,7/20/2008,4/2/2013,30,1,1, ,4,0,1,1,1,24.8340874811463,24.8340874811463,24.8340874811463,4/2/2013,1717,56,1,1,1,2,99.2,16.011810661,n,1717,24.8340874811463,24.8340874811463,0,997, , , , , , , , , , , , , , , , , , , , , , , , ,-1.95,.76,-.78,.68,2,2,2,2,2,2,2,2,2,2,2,2,2,2
78,1,14,17,1,4,1,6,4,2008,4,60,1,1, , , , , , , , , , , , , , , , , , , , , , , , , , , , , , , , , , , , , , , , , , , , , , , , , , , , , , , , , , , , , , , , , , , , , , , , , , , , , , , , , ,114,1,11,7804,2,4,2013,17,14,16,38,7,2,4,13,7,2,4,13,16,50,0,1,4/6/2008,4/2/2013,24,1,1, ,4,0,1,1,1,24.8340874811463,24.8340874811463,24.8340874811463,4/2/2013,1822,60,1,1,1, , , ,n,1822,24.8340874811463,24.8340874811463, , , , , , , , , , , , , , , , , , , , , , , , , , , , , , , , , , , , , , , , , , , , 